program: Orca
programVersion: 5.0.2
elementType: O O O N N N N N N N C C C C C C C C C C C C C C C C C C C C H H H H H H H H H H H H H H H H H H H H H H H
charge: 0
multiplicity: 1
keywords: wb97x-d3
keywords: def2-TZVPP
keywords: def2/J RIJCOSX
keywords: DEFGRID2
keywords: scfconv7
keywords: smallprint printgap noloewdin
keywords: NOSOSCF
formula: C20H23N7O3
InChI: InChI=1/C20H23N7O3/c1-20(2,3)30-19(28)22-16-12-8-11-15(21-16)13-29-24-17(14-9-6-5-7-10-14)18-23-25-26-27(18)4/h5-12,22H,13H2,1-4H3
53 atoms
O  -4.615827 -0.045507 0.057501
O  1.952835 -0.923061 1.738019
O  -4.127483 -1.582482 -1.532988
N  -2.724625 -1.131323 0.213063
N  -0.665464 -1.801931 0.84748
N  1.384977 2.003313 1.623857
N  2.654025 -0.700001 0.602884
N  3.43272 2.246291 2.19804
N  1.43426 2.955242 2.54464
N  2.655689 3.088604 2.877154
C  -5.916766 0.339982 -0.46119
C  -6.385533 1.390963 0.537187
C  -5.787008 0.958667 -1.847909
C  -6.875139 -0.844716 -0.456659
C  -3.867284 -0.97517 -0.526875
C  -1.642716 -1.964139 -0.030089
C  0.441456 -2.525347 0.735994
C  3.004242 0.51564 0.451938
C  3.77208 0.872395 -0.754326
C  1.502999 -2.263853 1.76893
C  -1.570451 -2.890172 -1.075503
C  2.631722 1.563272 1.420364
C  0.619917 -3.458627 -0.269026
C  -0.414879 -3.636862 -1.177711
C  4.449712 2.086341 -0.843564
C  3.825502 -0.013543 -1.833583
C  5.16787 2.405058 -1.98697
C  4.542188 0.310108 -2.969878
C  5.216622 1.522125 -3.052199
C  0.139757 1.589473 1.024664
H  -6.470426 0.975467 1.541898
H  -7.366598 1.766312 0.24735
H  -5.701248 2.239311 0.574096
H  -5.497423 0.231002 -2.602116
H  -6.747953 1.381369 -2.143488
H  -5.058585 1.770749 -1.847534
H  -7.880417 -0.493623 -0.692739
H  -6.914883 -1.311856 0.528399
H  -6.605947 -1.600836 -1.19011
H  -2.625667 -0.570017 1.045006
H  1.093613 -2.396861 2.770971
H  2.344277 -2.950751 1.643699
H  -2.380946 -3.014462 -1.773613
H  1.539773 -4.021432 -0.344487
H  -0.319878 -4.360152 -1.976904
H  4.44442 2.777648 -0.012179
H  3.294412 -0.953849 -1.778162
H  5.693763 3.349028 -2.037947
H  4.570767 -0.383717 -3.799642
H  5.775173 1.774689 -3.943894
H  -0.176371 0.627579 1.421698
H  -0.603584 2.349706 1.243697
H  0.257546 1.504005 -0.053691
totalener: -1384.97187698 hartree
nucrepener: 2843.65150425 hartree
electener: -4228.62338123 hartree
oneelecener: -7535.88599372 hartree
twoeener: 3307.26261250 hartree
kineticenergy: 1379.30507525 hartree
xcener: -132.291745121023 hartree
chargesum: -0.0000000
charge: -0.325633 -0.189253 -0.426596 -0.175694 -0.399223 0.085784 -0.101971 -0.199792 -0.148793 -0.081541 0.237264 -0.250852 -0.300620 -0.302711 0.494570 0.305075 0.113783 0.136077 -0.010321 0.031918 -0.196144 0.131437 -0.146560 -0.089924 -0.169092 -0.165031 -0.120767 -0.115498 -0.117997 -0.159893 0.097106 0.080903 0.096095 0.118082 0.089799 0.093015 0.089224 0.094812 0.117488 0.156554 0.102866 0.095507 0.154775 0.117710 0.131778 0.153873 0.124786 0.129106 0.124836 0.128172 0.113026 0.127482 0.121000
qa: -0.3256 -0.1893 -0.4266 -0.1757 -0.3992 0.0858 -0.1020 -0.1998 -0.1488 -0.0815 0.2373 -0.2509 -0.3006 -0.3027 0.4946 0.3051 0.1138 0.1361 -0.0103 0.0319 -0.1961 0.1314 -0.1466 -0.0899 -0.1691 -0.1650 -0.1208 -0.1155 -0.1180 -0.1599 0.0971 0.0809 0.0961 0.1181 0.0898 0.0930 0.0892 0.0948 0.1175 0.1566 0.1029 0.0955 0.1548 0.1177 0.1318 0.1539 0.1248 0.1291 0.1248 0.1282 0.1130 0.1275 0.1210
va: 2.1066 2.0044 2.0737 3.1793 3.0122 3.3337 2.9068 2.8992 2.7985 2.8566 3.8781 3.9107 3.9066 3.9077 4.2725 4.0162 3.8647 3.8943 3.7774 3.9599 3.9704 4.0879 3.9175 3.9758 3.9723 4.0206 3.9660 3.9513 3.9629 3.8344 1.0106 1.0102 1.0110 1.0187 1.0063 1.0093 1.0062 1.0089 1.0190 1.0468 1.0045 1.0073 1.0287 1.0046 1.0014 1.0259 1.0247 1.0029 1.0023 0.9993 1.0253 1.0079 0.9912
dispcorr: -0.026271047 hartree
energy: -1384.998148024811
dipole: -33.44414 31.75687 -1.68727 -0.74813 -0.49912 -1.24724 -12.69291 11.17050 -1.52242
magnitude: 2.59235 au
magnitude: 6.58922 debye
