program: Orca
programVersion: 5.0.2
elementType: O O O N N N N N N N C C C C C C C C C C C C C C C C C C C C H H H H H H H H H H H H H H H H H H H H H H H
charge: 0
multiplicity: 1
keywords: wb97x-d3
keywords: def2-TZVPP
keywords: def2/J RIJCOSX
keywords: DEFGRID2
keywords: scfconv7
keywords: smallprint printgap noloewdin
keywords: NOSOSCF
formula: C20H23N7O3
InChI: InChI=1/C20H23N7O3/c1-20(2,3)30-19(28)22-16-12-8-11-15(21-16)13-29-24-17(14-9-6-5-7-10-14)18-23-25-26-27(18)4/h5-12,22H,13H2,1-4H3
53 atoms
O  -3.123655 1.011564 -0.120535
O  2.495176 -1.935649 0.824117
O  -3.791883 -0.812059 -1.28295
N  -1.75503 -0.688098 -0.249174
N  0.047345 -2.030701 -0.100374
N  2.103473 0.336226 2.676936
N  2.731005 -0.996359 -0.135437
N  0.318481 0.725679 1.573752
N  1.145121 0.621925 3.550647
N  0.090296 0.852029 2.880514
C  -4.310321 1.807314 -0.34288
C  -4.506618 2.094357 -1.827518
C  -5.538803 1.144015 0.269716
C  -3.994143 3.101332 0.398298
C  -2.982313 -0.214804 -0.617235
C  -1.185302 -1.904583 -0.575499
C  0.743563 -3.120727 -0.349318
C  2.316622 0.161184 0.194817
C  2.591281 1.291452 -0.708612
C  2.142094 -3.158801 0.223977
C  -1.79654 -2.915739 -1.322187
C  1.579857 0.393827 1.450908
C  0.240182 -4.179431 -1.089508
C  -1.055792 -4.057513 -1.567352
C  3.574045 1.171721 -1.694228
C  1.881329 2.486115 -0.604088
C  3.837715 2.224299 -2.550202
C  2.149446 3.53797 -1.466824
C  3.127795 3.413231 -2.439086
C  3.431788 -0.019293 3.109833
H  -5.308401 2.823639 -1.951663
H  -4.77487 1.203233 -2.38933
H  -3.602836 2.52258 -2.263542
H  -5.820627 0.232608 -0.252144
H  -5.369559 0.90671 1.320908
H  -6.382441 1.83343 0.219453
H  -3.108712 3.586048 -0.014669
H  -3.815662 2.916657 1.457928
H  -4.829589 3.796141 0.311839
H  -1.157404 -0.085652 0.316389
H  2.205945 -3.901855 1.02186
H  2.8672 -3.4322 -0.550213
H  -2.800025 -2.809587 -1.698073
H  0.83382 -5.06231 -1.287904
H  -1.497494 -4.858691 -2.145672
H  4.133359 0.250377 -1.779858
H  1.099712 2.596542 0.134697
H  4.604694 2.119468 -3.306041
H  1.586252 4.45715 -1.376221
H  3.338823 4.236885 -3.108146
H  4.138756 0.177444 2.308507
H  3.692184 0.58475 3.973659
H  3.475708 -1.073514 3.371971
totalener: -1384.97098226 hartree
nucrepener: 2984.18821790 hartree
electener: -4369.15920016 hartree
oneelecener: -7818.56188410 hartree
twoeener: 3449.40268393 hartree
kineticenergy: 1379.29921106 hartree
xcener: -132.297202977258 hartree
chargesum: -0.0000000
charge: -0.309105 -0.214442 -0.443901 -0.211105 -0.385134 0.090137 -0.102337 -0.254202 -0.147370 -0.082267 0.245349 -0.306408 -0.307613 -0.250611 0.489049 0.296504 0.171688 0.118527 0.010633 0.016495 -0.209582 0.211304 -0.207791 -0.074741 -0.161221 -0.175565 -0.123153 -0.129556 -0.108836 -0.143467 0.084731 0.116525 0.091702 0.115451 0.096126 0.084443 0.090282 0.102519 0.075721 0.218698 0.103937 0.104545 0.147797 0.113668 0.125433 0.123518 0.149031 0.126738 0.128640 0.128875 0.118324 0.129208 0.122810
qa: -0.3091 -0.2144 -0.4439 -0.2111 -0.3851 0.0901 -0.1023 -0.2542 -0.1474 -0.0823 0.2453 -0.3064 -0.3076 -0.2506 0.4890 0.2965 0.1717 0.1185 0.0106 0.0165 -0.2096 0.2113 -0.2078 -0.0747 -0.1612 -0.1756 -0.1232 -0.1296 -0.1088 -0.1435 0.0847 0.1165 0.0917 0.1155 0.0961 0.0844 0.0903 0.1025 0.0757 0.2187 0.1039 0.1045 0.1478 0.1137 0.1254 0.1235 0.1490 0.1267 0.1286 0.1289 0.1183 0.1292 0.1228
va: 2.1213 1.9901 2.0604 3.1980 3.0351 3.3285 2.8782 2.8086 2.7911 2.8703 3.8832 3.9086 3.9107 3.9110 4.2681 4.0387 3.8248 3.8430 3.7623 3.9618 4.0027 3.9247 3.9720 3.9674 4.0187 3.9767 3.9563 3.9780 3.9601 3.8581 1.0062 1.0207 1.0092 1.0203 1.0088 1.0060 1.0117 1.0116 1.0091 1.0400 0.9920 1.0071 1.0327 1.0061 1.0015 1.0350 1.0236 1.0026 1.0031 0.9992 0.9956 1.0026 0.9955
dispcorr: -0.027860156 hartree
energy: -1384.998842415339
dipole: -15.78596 17.64397 1.85801 11.76292 -11.74102 0.02190 -6.50749 6.16194 -0.34556
magnitude: 1.88999 au
magnitude: 4.80399 debye
