program: Orca
programVersion: 5.0.2
elementType: O O O N N N N N N N C C C C C C C C C C C C C C C C C C C C H H H H H H H H H H H H H H H H H H H H H H H
charge: 0
multiplicity: 1
keywords: wb97x-d3
keywords: def2-TZVPP
keywords: def2/J RIJCOSX
keywords: DEFGRID2
keywords: scfconv7
keywords: smallprint printgap noloewdin
keywords: NOSOSCF
formula: C20H23N7O3
InChI: InChI=1/C20H23N7O3/c1-20(2,3)30-19(28)22-16-12-8-11-15(21-16)13-29-24-17(14-9-6-5-7-10-14)18-23-25-26-27(18)4/h5-12,22H,13H2,1-4H3
53 atoms
O  -4.049184 1.096099 -0.57971
O  1.722566 -2.246214 -0.600728
O  -3.219302 2.171861 -2.390828
N  -2.177446 0.370139 -1.449565
N  -0.299145 -0.805985 -1.860636
N  2.877266 1.495794 0.779451
N  2.235271 -1.073156 -0.178323
N  3.119352 0.680885 2.74785
N  3.359974 2.452228 1.562391
N  3.496941 1.953158 2.726744
C  -5.247259 1.902891 -0.432589
C  -6.136972 1.789364 -1.665148
C  -5.940361 1.268209 0.76648
C  -4.891268 3.351894 -0.123028
C  -3.170097 1.307928 -1.553354
C  -1.058936 0.205672 -2.250372
C  0.814235 -1.077581 -2.523043
C  2.235838 -0.911766 1.087032
C  1.784931 -1.877427 2.110117
C  1.628729 -2.235283 -2.008371
C  -0.744201 1.005019 -3.354462
C  2.734592 0.389207 1.528288
C  1.222045 -0.3491 -3.627797
C  0.413899 0.701016 -4.041609
C  0.907647 -1.465031 3.109321
C  2.221486 -3.199461 2.091806
C  0.456608 -2.364839 4.060217
C  1.783582 -4.092488 3.055256
C  0.894552 -3.679952 4.036374
C  2.587609 1.769688 -0.609716
H  -5.703949 2.271319 -2.538033
H  -7.094694 2.26919 -1.459888
H  -6.339713 0.745019 -1.906869
H  -6.183503 0.222294 0.576592
H  -5.316598 1.318021 1.659453
H  -6.870695 1.794222 0.979475
H  -5.798807 3.896587 0.139752
H  -4.433362 3.857175 -0.969726
H  -4.213771 3.414369 0.729623
H  -2.23929 -0.305177 -0.702213
H  1.145852 -3.180957 -2.261545
H  2.623407 -2.230544 -2.466759
H  -1.376631 1.822386 -3.657187
H  2.143722 -0.586002 -4.141759
H  0.693132 1.297945 -4.899971
H  0.57614 -0.436389 3.148751
H  2.918275 -3.532197 1.335491
H  -0.2294 -2.033702 4.82818
H  2.13907 -5.114085 3.038998
H  0.549008 -4.380556 4.785102
H  3.268575 1.229844 -1.261369
H  1.57073 1.472864 -0.853565
H  2.703597 2.839003 -0.755519
totalener: -1384.96975433 hartree
nucrepener: 2872.74888687 hartree
electener: -4257.71864121 hartree
oneelecener: -7594.55896082 hartree
twoeener: 3336.84031961 hartree
kineticenergy: 1379.30614992 hartree
xcener: -132.294064440831 hartree
chargesum: -0.0000000
charge: -0.324042 -0.178312 -0.429859 -0.166203 -0.347745 0.084006 -0.146430 -0.156187 -0.149067 -0.096591 0.240713 -0.304346 -0.251151 -0.301878 0.494923 0.264529 0.119294 0.222278 0.079745 0.023078 -0.190218 0.036682 -0.167486 -0.090381 -0.178243 -0.133222 -0.131521 -0.142553 -0.109230 -0.129817 0.117576 0.088753 0.094372 0.095993 0.096915 0.080259 0.089029 0.116811 0.095292 0.156030 0.094705 0.084224 0.154317 0.115330 0.132463 0.118585 0.113395 0.124883 0.123406 0.126058 0.110929 0.104398 0.125514
qa: -0.3240 -0.1783 -0.4299 -0.1662 -0.3477 0.0840 -0.1464 -0.1562 -0.1491 -0.0966 0.2407 -0.3043 -0.2512 -0.3019 0.4949 0.2645 0.1193 0.2223 0.0797 0.0231 -0.1902 0.0367 -0.1675 -0.0904 -0.1782 -0.1332 -0.1315 -0.1426 -0.1092 -0.1298 0.1176 0.0888 0.0944 0.0960 0.0969 0.0803 0.0890 0.1168 0.0953 0.1560 0.0947 0.0842 0.1543 0.1153 0.1325 0.1186 0.1134 0.1249 0.1234 0.1261 0.1109 0.1044 0.1255
va: 2.1107 2.0326 2.0690 3.1648 3.0313 3.3465 2.8803 2.9746 2.7743 2.8454 3.8743 3.9078 3.9108 3.9085 4.2720 4.0466 3.8572 3.7882 3.6209 4.0064 3.9480 4.2223 3.9097 3.9750 4.0556 3.9978 3.9784 3.9717 3.9605 3.8675 1.0194 1.0061 1.0088 1.0110 1.0109 1.0100 1.0061 1.0190 1.0091 1.0489 0.9958 1.0034 1.0299 1.0044 1.0013 1.0127 1.0230 1.0022 1.0027 0.9993 0.9998 0.9942 1.0103
dispcorr: -0.026216359 hartree
energy: -1384.995970692880
dipole: -31.28126 29.80735 -1.47390 6.10891 -7.17072 -1.06181 -5.88125 4.21799 -1.66327
magnitude: 2.46298 au
magnitude: 6.26040 debye
