program: Orca
programVersion: 5.0.2
elementType: O O O N N N N N N N C C C C C C C C C C C C C C C C C C C C H H H H H H H H H H H H H H H H H H H H H H H
charge: 0
multiplicity: 1
keywords: wb97x-d3
keywords: def2-TZVPP
keywords: def2/J RIJCOSX
keywords: DEFGRID2
keywords: scfconv7
keywords: smallprint printgap noloewdin
keywords: NOSOSCF
formula: C20H23N7O3
InChI: InChI=1/C20H23N7O3/c1-20(2,3)30-19(28)22-16-12-8-11-15(21-16)13-29-24-17(14-9-6-5-7-10-14)18-23-25-26-27(18)4/h5-12,22H,13H2,1-4H3
53 atoms
O  -4.423234 1.493638 -0.258539
O  1.149323 -2.457228 0.211097
O  -3.713297 1.807219 -2.386285
N  -2.731932 0.304752 -0.971133
N  -1.092457 -1.237096 -1.128708
N  4.265733 0.154571 -0.655476
N  2.161232 -1.622925 -0.102536
N  4.415709 0.639468 1.426439
N  5.27342 1.005367 -0.503656
N  5.3516 1.280363 0.736949
C  -5.487467 2.481373 -0.278435
C  -4.924706 3.880746 -0.496316
C  -6.543295 2.126217 -1.319456
C  -6.079569 2.370967 1.121333
C  -3.644412 1.268553 -1.311801
C  -1.752822 -0.278359 -1.759279
C  -0.126149 -1.887999 -1.76217
C  2.604744 -0.940178 0.880181
C  2.068079 -0.938761 2.258594
C  0.57121 -2.963432 -0.973544
C  -1.475594 0.08602 -3.081433
C  3.734268 -0.069945 0.55892
C  0.229954 -1.604634 -3.068884
C  -0.466932 -0.598992 -3.726429
C  0.708764 -0.717025 2.472685
C  2.906811 -1.147639 3.348969
C  0.201672 -0.702219 3.760671
C  2.390436 -1.150762 4.634942
C  1.039061 -0.925321 4.844298
C  3.923813 -0.331331 -1.971843
H  -5.71802 4.613694 -0.344739
H  -4.530826 4.018862 -1.500394
H  -4.134246 4.100691 0.2225
H  -6.889701 1.09978 -1.190859
H  -7.406268 2.780842 -1.19185
H  -6.181438 2.246484 -2.337486
H  -5.335907 2.596462 1.886344
H  -6.47211 1.370966 1.309322
H  -6.900542 3.078387 1.234733
H  -2.785091 -0.085263 -0.042421
H  -0.149209 -3.709462 -0.635913
H  1.325536 -3.464132 -1.588502
H  -2.026247 0.868627 -3.575661
H  1.027593 -2.149432 -3.555256
H  -0.221623 -0.343793 -4.749035
H  0.045796 -0.553486 1.633256
H  3.965654 -1.301539 3.19719
H  -0.852999 -0.520019 3.918992
H  3.050363 -1.320347 5.475035
H  0.639161 -0.920359 5.849752
H  4.075298 -1.40546 -2.036074
H  2.884205 -0.113986 -2.203104
H  4.575027 0.176711 -2.676462
totalener: -1384.97037556 hartree
nucrepener: 2834.52231108 hartree
electener: -4219.49268664 hartree
oneelecener: -7518.03432194 hartree
twoeener: 3298.54163530 hartree
kineticenergy: 1379.29835533 hartree
xcener: -132.291379510683 hartree
chargesum: -0.0000000
charge: -0.324614 -0.183378 -0.428017 -0.167728 -0.368707 0.081071 -0.152824 -0.168944 -0.147880 -0.104408 0.237754 -0.302515 -0.301278 -0.252162 0.495117 0.294899 0.126004 0.218967 0.081940 0.034055 -0.194368 0.065085 -0.203506 -0.079253 -0.141016 -0.157762 -0.132244 -0.133891 -0.114912 -0.141151 0.088755 0.117365 0.096055 0.094194 0.088718 0.117887 0.096674 0.096146 0.080515 0.152877 0.099837 0.088151 0.155102 0.119135 0.132364 0.107931 0.115159 0.118819 0.125286 0.125067 0.109960 0.113803 0.125867
qa: -0.3246 -0.1834 -0.4280 -0.1677 -0.3687 0.0811 -0.1528 -0.1689 -0.1479 -0.1044 0.2378 -0.3025 -0.3013 -0.2522 0.4951 0.2949 0.1260 0.2190 0.0819 0.0341 -0.1944 0.0651 -0.2035 -0.0793 -0.1410 -0.1578 -0.1322 -0.1339 -0.1149 -0.1412 0.0888 0.1174 0.0961 0.0942 0.0887 0.1179 0.0967 0.0961 0.0805 0.1529 0.0998 0.0882 0.1551 0.1191 0.1324 0.1079 0.1152 0.1188 0.1253 0.1251 0.1100 0.1138 0.1259
va: 2.1089 2.0275 2.0721 3.1803 3.0273 3.3458 2.8751 2.9504 2.7761 2.8494 3.8787 3.9089 3.9072 3.9106 4.2724 4.0380 3.8428 3.8012 3.5804 3.9754 3.9623 4.2031 3.9062 3.9590 4.0158 4.0335 3.9624 3.9794 3.9631 3.8617 1.0060 1.0188 1.0089 1.0091 1.0061 1.0190 1.0108 1.0107 1.0102 1.0509 1.0031 1.0067 1.0289 1.0016 1.0010 1.0183 1.0278 1.0028 1.0021 0.9996 1.0005 0.9926 1.0104
dispcorr: -0.025735316 hartree
energy: -1384.996110873460
dipole: -34.37248 32.25089 -2.12159 10.00083 -11.06829 -1.06746 -2.28642 1.48593 -0.80048
magnitude: 2.50627 au
magnitude: 6.37043 debye
