program: Orca
programVersion: 5.0.2
elementType: O O O N N N N N N N C C C C C C C C C C C C C C C C C C C C H H H H H H H H H H H H H H H H H H H H H H H
charge: 0
multiplicity: 1
keywords: wb97x-d3
keywords: def2-TZVPP
keywords: def2/J RIJCOSX
keywords: DEFGRID2
keywords: scfconv7
keywords: smallprint printgap noloewdin
keywords: NOSOSCF
formula: C20H23N7O3
InChI: InChI=1/C20H23N7O3/c1-20(2,3)30-19(28)22-16-12-8-11-15(21-16)13-29-24-17(14-9-6-5-7-10-14)18-23-25-26-27(18)4/h5-12,22H,13H2,1-4H3
53 atoms
O  -3.582668 3.144475 -0.820266
O  2.651327 0.130507 -0.270634
O  -3.903124 1.451854 -2.28851
N  -1.854595 1.931286 -1.397847
N  0.236368 1.110649 -1.626607
N  1.726656 -3.880668 0.35707
N  2.372877 -1.177222 -0.104994
N  2.097089 -3.614635 2.450421
N  1.559744 -5.053216 0.955506
N  1.787443 -4.879441 2.196203
C  -4.959395 3.605365 -0.784766
C  -5.872819 2.53015 -0.209506
C  -4.895342 4.798022 0.160865
C  -5.422342 4.063519 -2.162905
C  -3.200946 2.116771 -1.571142
C  -1.022571 1.017762 -2.02571
C  1.149162 0.31044 -2.161423
C  2.342478 -1.56127 1.111384
C  2.53711 -0.711708 2.306609
C  2.551948 0.466948 -1.641451
C  -1.442968 0.098674 -2.993811
C  2.064026 -2.984001 1.300241
C  0.841378 -0.626882 -3.132148
C  -0.48118 -0.722451 -3.544443
C  1.780746 0.44646 2.472997
C  3.467094 -1.066708 3.279132
C  1.949465 1.230308 3.601982
C  3.64458 -0.269933 4.398185
C  2.883734 0.876739 4.564542
C  1.520541 -3.76151 -1.067068
H  -6.867835 2.9486 -0.053519
H  -5.507341 2.183776 0.758261
H  -5.9723 1.673133 -0.871314
H  -4.228478 5.571921 -0.221052
H  -5.886342 5.237129 0.272911
H  -4.545962 4.503575 1.151044
H  -5.525312 3.239582 -2.86422
H  -4.732696 4.796749 -2.583805
H  -6.395776 4.546564 -2.069991
H  -1.372814 2.542047 -0.755775
H  3.251365 -0.130738 -2.234379
H  2.859521 1.511549 -1.693064
H  -2.473546 0.037196 -3.300011
H  1.609185 -1.264983 -3.547878
H  -0.767258 -1.442964 -4.299547
H  1.053885 0.732737 1.724595
H  4.048622 -1.970804 3.168876
H  1.349982 2.121908 3.729252
H  4.372604 -0.554215 5.146021
H  3.015855 1.492843 5.444206
H  0.778137 -2.99831 -1.285359
H  2.447305 -3.494683 -1.56821
H  1.174604 -4.727918 -1.420358
totalener: -1384.97024975 hartree
nucrepener: 2816.64496536 hartree
electener: -4201.61521511 hartree
oneelecener: -7482.28200939 hartree
twoeener: 3280.66679428 hartree
kineticenergy: 1379.30257674 hartree
xcener: -132.292411286970 hartree
chargesum: 0.0000000
charge: -0.324785 -0.182784 -0.429398 -0.169310 -0.361419 0.080872 -0.147815 -0.170047 -0.147532 -0.105425 0.241740 -0.302526 -0.251420 -0.304122 0.494964 0.293844 0.129996 0.224318 0.078069 0.023025 -0.192946 0.064648 -0.211462 -0.081815 -0.147642 -0.157973 -0.133742 -0.133843 -0.114979 -0.140111 0.088741 0.094771 0.118373 0.096031 0.080618 0.096036 0.118748 0.093998 0.088167 0.152569 0.088737 0.102079 0.156352 0.121914 0.132990 0.113013 0.115047 0.121175 0.125187 0.125659 0.115762 0.108965 0.124691
qa: -0.3248 -0.1828 -0.4294 -0.1693 -0.3614 0.0809 -0.1478 -0.1700 -0.1475 -0.1054 0.2417 -0.3025 -0.2514 -0.3041 0.4950 0.2938 0.1300 0.2243 0.0781 0.0230 -0.1929 0.0646 -0.2115 -0.0818 -0.1476 -0.1580 -0.1337 -0.1338 -0.1150 -0.1401 0.0887 0.0948 0.1184 0.0960 0.0806 0.0960 0.1187 0.0940 0.0882 0.1526 0.0887 0.1021 0.1564 0.1219 0.1330 0.1130 0.1150 0.1212 0.1252 0.1257 0.1158 0.1090 0.1247
va: 2.1111 2.0305 2.0688 3.1822 3.0330 3.3481 2.8850 2.9462 2.7746 2.8486 3.8732 3.9089 3.9110 3.9066 4.2717 4.0410 3.8356 3.8093 3.5845 3.9768 3.9570 4.1990 3.9067 3.9515 4.0104 4.0369 3.9634 3.9820 3.9621 3.8659 1.0061 1.0091 1.0185 1.0109 1.0101 1.0111 1.0194 1.0087 1.0063 1.0514 1.0047 1.0046 1.0288 0.9990 1.0010 1.0233 1.0274 1.0026 1.0021 0.9994 0.9914 1.0000 1.0103
dispcorr: -0.025518108 hartree
energy: -1384.995767856571
dipole: -26.50391 26.10971 -0.39421 24.74980 -22.65967 2.09013 -7.00353 5.46940 -1.53413
magnitude: 2.62252 au
magnitude: 6.66591 debye
