program: Orca
programVersion: 5.0.2
elementType: O O O N N N N N N N C C C C C C C C C C C C C C C C C C C C H H H H H H H H H H H H H H H H H H H H H H H
charge: 0
multiplicity: 1
keywords: wb97x-d3
keywords: def2-TZVPP
keywords: def2/J RIJCOSX
keywords: DEFGRID2
keywords: scfconv7
keywords: smallprint printgap noloewdin
keywords: NOSOSCF
formula: C20H23N7O3
InChI: InChI=1/C20H23N7O3/c1-20(2,3)30-19(28)22-16-12-8-11-15(21-16)13-29-24-17(14-9-6-5-7-10-14)18-23-25-26-27(18)4/h5-12,22H,13H2,1-4H3
53 atoms
O  -3.530095 2.898168 -0.636947
O  2.718527 0.143782 -0.323048
O  -3.785032 1.515691 -2.412559
N  -1.785346 1.781911 -1.337147
N  0.325552 1.042846 -1.634209
N  1.491625 -3.77641 0.340346
N  2.348001 -1.139571 -0.144125
N  1.85413 -3.513785 2.436009
N  1.23275 -4.926865 0.94902
N  1.455568 -4.755693 2.190869
C  -4.90357 3.362517 -0.566783
C  -5.296128 4.097346 -1.843164
C  -5.850657 2.208378 -0.261099
C  -4.872443 4.336023 0.604806
C  -3.11862 2.020968 -1.546465
C  -0.922352 0.986205 -2.07305
C  1.265008 0.340266 -2.25202
C  2.263933 -1.5000 1.076714
C  2.489797 -0.644774 2.26216
C  2.658564 0.463217 -1.697232
C  -1.30366 0.204272 -3.169245
C  1.881895 -2.896412 1.278759
C  0.99698 -0.46039 -3.348595
C  -0.313733 -0.517029 -3.803993
C  1.809144 0.564082 2.390405
C  3.374296 -1.041499 3.260364
C  2.007097 1.357367 3.507942
C  3.582711 -0.235426 4.367548
C  2.897285 0.962474 4.495859
C  1.313962 -3.658703 -1.088191
H  -6.267002 4.572814 -1.698559
H  -5.375176 3.4317 -2.699174
H  -4.577758 4.884283 -2.077322
H  -5.52815 1.662024 0.626381
H  -6.846272 2.604494 -0.057751
H  -5.932735 1.509653 -1.090201
H  -5.864275 4.758104 0.764215
H  -4.18443 5.161232 0.417379
H  -4.567918 3.839455 1.526768
H  -1.332076 2.277308 -0.584415
H  3.35384 -0.159329 -2.269566
H  2.998601 1.497988 -1.756193
H  -2.325937 0.170136 -3.506427
H  1.7846 -1.025822 -3.827687
H  -0.568809 -1.132525 -4.656742
H  1.119809 0.882168 1.619485
H  3.896019 -1.984368 3.179594
H  1.466727 2.28956 3.605681
H  4.275902 -0.551321 5.135511
H  3.053446 1.58667 5.365851
H  0.640756 -2.839517 -1.326714
H  2.265853 -3.47611 -1.579795
H  0.893609 -4.5977 -1.43467
totalener: -1384.97038698 hartree
nucrepener: 2831.71456468 hartree
electener: -4216.68495166 hartree
oneelecener: -7512.44317742 hartree
twoeener: 3295.75822577 hartree
kineticenergy: 1379.30024422 hartree
xcener: -132.292097192460 hartree
chargesum: 0.0000000
charge: -0.323894 -0.181833 -0.427965 -0.168683 -0.363901 0.080262 -0.151385 -0.169584 -0.147616 -0.105498 0.237052 -0.301900 -0.301479 -0.252000 0.493821 0.290999 0.126745 0.226023 0.080649 0.031407 -0.190017 0.063252 -0.199951 -0.083418 -0.149201 -0.159251 -0.130847 -0.133218 -0.116745 -0.131279 0.088693 0.118306 0.094001 0.096145 0.088729 0.117242 0.080785 0.095527 0.097109 0.153008 0.087162 0.099051 0.155224 0.116178 0.133066 0.109447 0.115398 0.120937 0.125334 0.125463 0.110235 0.107485 0.124930
qa: -0.3239 -0.1818 -0.4280 -0.1687 -0.3639 0.0803 -0.1514 -0.1696 -0.1476 -0.1055 0.2371 -0.3019 -0.3015 -0.2520 0.4938 0.2910 0.1267 0.2260 0.0806 0.0314 -0.1900 0.0633 -0.2000 -0.0834 -0.1492 -0.1593 -0.1308 -0.1332 -0.1167 -0.1313 0.0887 0.1183 0.0940 0.0961 0.0887 0.1172 0.0808 0.0955 0.0971 0.1530 0.0872 0.0991 0.1552 0.1162 0.1331 0.1094 0.1154 0.1209 0.1253 0.1255 0.1102 0.1075 0.1249
va: 2.1091 2.0305 2.0722 3.1803 3.0320 3.3506 2.8831 2.9470 2.7752 2.8486 3.8775 3.9065 3.9089 3.9112 4.2733 4.0401 3.8511 3.8023 3.5839 3.9765 3.9600 4.2009 3.9091 3.9535 4.0105 4.0373 3.9592 3.9802 3.9632 3.8640 1.0063 1.0190 1.0089 1.0088 1.0061 1.0185 1.0102 1.0108 1.0110 1.0505 1.0054 1.0016 1.0287 1.0035 1.0008 1.0252 1.0276 1.0025 1.0020 0.9995 0.9937 1.0008 1.0100
dispcorr: -0.025660747 hartree
energy: -1384.996047723033
dipole: -25.68387 25.42553 -0.25834 23.57283 -21.56557 2.00726 -5.86476 4.38014 -1.48462
magnitude: 2.50996 au
magnitude: 6.37982 debye
