program: Orca
programVersion: 5.0.2
elementType: O O O N N N N N N N C C C C C C C C C C C C C C C C C C C C H H H H H H H H H H H H H H H H H H H H H H H
charge: 0
multiplicity: 1
keywords: wb97x-d3
keywords: def2-TZVPP
keywords: def2/J RIJCOSX
keywords: DEFGRID2
keywords: scfconv7
keywords: smallprint printgap noloewdin
keywords: NOSOSCF
formula: C20H23N7O3
InChI: InChI=1/C20H23N7O3/c1-20(2,3)30-19(28)22-16-12-8-11-15(21-16)13-29-24-17(14-9-6-5-7-10-14)18-23-25-26-27(18)4/h5-12,22H,13H2,1-4H3
53 atoms
O  -5.428826 2.188658 -1.290881
O  1.242651 -0.408485 2.247361
O  -3.673552 2.876281 -2.546264
N  -3.413314 1.630262 -0.649018
N  -1.667577 0.896436 0.578419
N  1.998904 -3.405448 -0.54348
N  1.433901 -1.454675 1.413341
N  3.976937 -3.615823 0.257371
N  2.594867 -4.404351 -1.180717
N  3.768047 -4.515702 -0.695581
C  -6.469011 2.829718 -2.074303
C  -6.292786 4.343994 -2.079468
C  -6.514957 2.258887 -3.486472
C  -7.740133 2.459571 -1.319912
C  -4.139388 2.296596 -1.59944
C  -2.035358 1.542671 -0.518518
C  -0.379091 0.752439 0.849888
C  2.652446 -1.813542 1.286629
C  3.824589 -1.216924 1.960596
C  -0.089723 0.041288 2.145291
C  -1.114277 2.064259 -1.429665
C  2.869582 -2.920141 0.358056
C  0.619996 1.249207 0.027737
C  0.224395 1.905473 -1.129118
C  4.930311 -0.830574 1.207713
C  3.838573 -1.024133 3.33993
C  6.021946 -0.238698 1.821013
C  4.939193 -0.449178 3.952078
C  6.029496 -0.048157 3.194142
C  0.649022 -3.023928 -0.8907
H  -6.19986 4.729304 -1.062863
H  -7.174212 4.806576 -2.525028
H  -5.424691 4.660791 -2.652048
H  -7.395655 2.644535 -4.001439
H  -5.64035 2.530839 -4.072286
H  -6.597034 1.171277 -3.465618
H  -7.722361 2.843733 -0.299384
H  -7.876558 1.378491 -1.276163
H  -8.608022 2.886196 -1.822193
H  -3.917423 1.194438 0.108083
H  -0.224031 0.729554 2.982511
H  -0.796011 -0.783511 2.274178
H  -1.432165 2.573606 -2.323618
H  1.665619 1.141388 0.277379
H  0.969571 2.303853 -1.805288
H  4.94286 -0.994199 0.138775
H  2.99684 -1.336165 3.941929
H  6.872411 0.063372 1.224838
H  4.944394 -0.313757 5.025305
H  6.886298 0.405961 3.674087
H  0.380119 -3.578584 -1.784304
H  -0.039153 -3.264137 -0.084927
H  0.59305 -1.956308 -1.086185
totalener: -1384.97272165 hartree
nucrepener: 2753.17145666 hartree
electener: -4138.14417831 hartree
oneelecener: -7355.14957801 hartree
twoeener: 3217.00539970 hartree
kineticenergy: 1379.29329484 hartree
xcener: -132.291711790050 hartree
chargesum: -0.0000000
charge: -0.325449 -0.200944 -0.428150 -0.170913 -0.369034 0.079781 -0.152051 -0.155638 -0.147698 -0.096698 0.240041 -0.303076 -0.301345 -0.251769 0.494166 0.283131 0.123558 0.211793 0.074375 0.054663 -0.194628 0.039473 -0.198941 -0.084385 -0.180367 -0.129679 -0.128575 -0.140767 -0.108704 -0.131329 0.094385 0.087986 0.118264 0.088762 0.117574 0.093698 0.095750 0.096082 0.080072 0.150513 0.100532 0.099085 0.153619 0.127475 0.131237 0.119567 0.115706 0.127432 0.125193 0.126907 0.126239 0.112852 0.110230
qa: -0.3254 -0.2009 -0.4282 -0.1709 -0.3690 0.0798 -0.1521 -0.1556 -0.1477 -0.0967 0.2400 -0.3031 -0.3013 -0.2518 0.4942 0.2831 0.1236 0.2118 0.0744 0.0547 -0.1946 0.0395 -0.1989 -0.0844 -0.1804 -0.1297 -0.1286 -0.1408 -0.1087 -0.1313 0.0944 0.0880 0.1183 0.0888 0.1176 0.0937 0.0957 0.0961 0.0801 0.1505 0.1005 0.0991 0.1536 0.1275 0.1312 0.1196 0.1157 0.1274 0.1252 0.1269 0.1262 0.1129 0.1102
va: 2.1072 2.0148 2.0713 3.1766 3.0498 3.3499 2.8580 2.9767 2.7765 2.8470 3.8774 3.9077 3.9085 3.9112 4.2743 4.0668 3.8503 3.7912 3.6047 3.9116 3.9435 4.2243 3.9250 3.9590 4.0436 3.9932 3.9779 3.9687 3.9610 3.8575 1.0089 1.0062 1.0193 1.0061 1.0193 1.0091 1.0109 1.0111 1.0101 1.0533 0.9971 1.0243 1.0287 1.0131 1.0023 1.0142 1.0230 1.0016 1.0023 0.9992 1.0093 0.9991 0.9932
dispcorr: -0.025145617 hartree
energy: -1384.997867269922
dipole: -35.34516 33.39343 -1.95173 21.68872 -19.89183 1.79689 -9.26555 9.85424 0.58868
magnitude: 2.71746 au
magnitude: 6.90723 debye
