program: Orca
programVersion: 5.0.2
elementType: O O O N N N N N N N C C C C C C C C C C C C C C C C C C C C H H H H H H H H H H H H H H H H H H H H H H H
charge: 0
multiplicity: 1
keywords: wb97x-d3
keywords: def2-TZVPP
keywords: def2/J RIJCOSX
keywords: DEFGRID2
keywords: scfconv7
keywords: smallprint printgap noloewdin
keywords: NOSOSCF
formula: C20H23N7O3
InChI: InChI=1/C20H23N7O3/c1-20(2,3)30-19(28)22-16-12-8-11-15(21-16)13-29-24-17(14-9-6-5-7-10-14)18-23-25-26-27(18)4/h5-12,22H,13H2,1-4H3
53 atoms
O  -3.279639 0.585002 -1.163831
O  3.108704 -0.276046 -0.400924
O  -2.840995 2.689469 -1.878254
N  -1.193787 1.222144 -1.279272
N  1.056448 1.261873 -1.160951
N  1.326667 0.038422 3.344508
N  2.575418 -0.153473 0.833539
N  0.800477 -2.036282 3.248503
N  0.716097 -0.282792 4.478388
N  0.41337 -1.517537 4.407457
C  -4.725749 0.649704 -1.269718
C  -5.150868 0.856307 -2.718492
C  -5.163177 -0.727741 -0.788624
C  -5.29179 1.725403 -0.350772
C  -2.493686 1.607315 -1.481115
C  -0.034798 1.960521 -1.450407
C  2.243079 1.833908 -1.245764
C  1.94232 -1.184627 1.236205
C  1.692795 -2.424526 0.46767
C  3.44788 0.988835 -0.899784
C  0.015168 3.290011 -1.86946
C  1.377212 -1.06619 2.579832
C  2.405732 3.154267 -1.639663
C  1.265866 3.87391 -1.959486
C  1.985071 -3.670033 1.014938
C  1.138637 -2.350572 -0.809283
C  1.735034 -4.824795 0.290892
C  0.874451 -3.508352 -1.520883
C  1.17597 -4.747729 -0.975112
C  1.770777 1.395013 3.122431
H  -6.232136 0.737138 -2.796878
H  -4.691596 0.110954 -3.369537
H  -4.896461 1.846612 -3.088944
H  -4.846449 -0.908528 0.238976
H  -6.249487 -0.805748 -0.823291
H  -4.750266 -1.518068 -1.416401
H  -5.042881 2.730243 -0.682921
H  -4.931114 1.594777 0.670493
H  -6.378887 1.640793 -0.32715
H  -1.033155 0.285448 -0.939984
H  4.036236 0.79537 -1.799327
H  4.0899 1.529433 -0.194659
H  -0.879342 3.840285 -2.108209
H  3.388406 3.604188 -1.694736
H  1.346517 4.905274 -2.276984
H  2.399429 -3.741974 2.010198
H  0.913849 -1.38587 -1.244405
H  1.969209 -5.787778 0.724344
H  0.436748 -3.44136 -2.508104
H  0.973314 -5.651389 -1.534816
H  1.341904 1.790916 2.205818
H  1.436575 1.982165 3.972147
H  2.853715 1.438212 3.045881
totalener: -1384.96901964 hartree
nucrepener: 2915.56810583 hartree
electener: -4300.53712547 hartree
oneelecener: -7680.33320055 hartree
twoeener: 3379.79607507 hartree
kineticenergy: 1379.30245003 hartree
xcener: -132.296449132438 hartree
chargesum: -0.0000000
charge: -0.320587 -0.196269 -0.427844 -0.175559 -0.385779 0.079187 -0.133587 -0.166827 -0.147956 -0.107254 0.236810 -0.302692 -0.250121 -0.303012 0.490530 0.292157 0.148310 0.210963 0.104759 0.014224 -0.197846 0.067348 -0.181724 -0.083972 -0.155233 -0.183491 -0.132881 -0.144728 -0.113901 -0.136194 0.088794 0.094121 0.116928 0.101162 0.079407 0.095977 0.116435 0.096395 0.088368 0.162043 0.111373 0.099126 0.152065 0.118924 0.130563 0.114202 0.118023 0.125546 0.122090 0.125305 0.110026 0.125395 0.110899
qa: -0.3206 -0.1963 -0.4278 -0.1756 -0.3858 0.0792 -0.1336 -0.1668 -0.1480 -0.1073 0.2368 -0.3027 -0.2501 -0.3030 0.4905 0.2922 0.1483 0.2110 0.1048 0.0142 -0.1978 0.0673 -0.1817 -0.0840 -0.1552 -0.1835 -0.1329 -0.1447 -0.1139 -0.1362 0.0888 0.0941 0.1169 0.1012 0.0794 0.0960 0.1164 0.0964 0.0884 0.1620 0.1114 0.0991 0.1521 0.1189 0.1306 0.1142 0.1180 0.1255 0.1221 0.1253 0.1100 0.1254 0.1109
va: 2.1106 2.0349 2.0749 3.2014 3.0010 3.3504 2.8543 2.9466 2.7757 2.8473 3.8780 3.9076 3.9103 3.9074 4.2733 4.0166 3.8139 3.7968 3.5588 3.9719 3.9900 4.1897 3.9578 3.9797 4.0369 3.9926 3.9735 4.0050 3.9614 3.8616 1.0066 1.0092 1.0187 1.0107 1.0095 1.0110 1.0191 1.0089 1.0063 1.0424 0.9931 1.0062 1.0295 1.0045 1.0008 1.0293 1.0395 1.0019 1.0038 0.9993 0.9933 1.0100 1.0001
dispcorr: -0.026574063 hartree
energy: -1384.995593701816
dipole: -23.71360 24.20113 0.48752 5.54711 -4.42462 1.12248 -13.14973 11.46095 -1.68878
magnitude: 2.08557 au
magnitude: 5.30111 debye
