program: Orca
programVersion: 5.0.2
elementType: O O O N N N N N N N C C C C C C C C C C C C C C C C C C C C H H H H H H H H H H H H H H H H H H H H H H H
charge: 0
multiplicity: 1
keywords: wb97x-d3
keywords: def2-TZVPP
keywords: def2/J RIJCOSX
keywords: DEFGRID2
keywords: scfconv7
keywords: smallprint printgap noloewdin
keywords: NOSOSCF
formula: C20H23N7O3
InChI: InChI=1/C20H23N7O3/c1-20(2,3)30-19(28)22-16-12-8-11-15(21-16)13-29-24-17(14-9-6-5-7-10-14)18-23-25-26-27(18)4/h5-12,22H,13H2,1-4H3
53 atoms
O  -5.055389 2.480044 -1.520964
O  2.117466 0.722181 1.409429
O  -3.831556 1.617982 -3.220277
N  -2.953805 2.007727 -1.14572
N  -0.952261 1.709689 -0.147292
N  0.976121 -3.264166 1.173431
N  1.707302 -0.563499 1.400666
N  2.892792 -3.851818 1.932617
N  0.984961 -4.586023 1.287781
N  2.127196 -4.919079 1.742708
C  -6.310973 2.581302 -2.241949
C  -6.185339 3.536246 -3.42304
C  -6.801307 1.205019 -2.676214
C  -7.255978 3.164061 -1.198434
C  -3.951064 1.998972 -2.084449
C  -1.634022 1.605317 -1.280102
C  0.328944 1.377842 -0.121515
C  2.625299 -1.42193 1.617665
C  4.055204 -1.142699 1.874603
C  1.002759 1.566637 1.212517
C  -1.060433 1.134962 -2.462477
C  2.174271 -2.812224 1.582146
C  1.003516 0.91983 -1.243083
C  0.279169 0.797872 -2.419102
C  4.796726 -0.374441 0.981178
C  4.673449 -1.650678 3.013393
C  6.136136 -0.119533 1.222495
C  6.009499 -1.380141 3.259756
C  6.744058 -0.616886 2.365459
C  -0.193534 -2.589589 0.65672
H  -7.175047 3.716925 -3.844593
H  -5.553966 3.139006 -4.213869
H  -5.783229 4.499709 -3.106169
H  -6.833665 0.516769 -1.830112
H  -7.816477 1.292142 -3.065594
H  -6.181589 0.769728 -3.456204
H  -6.913627 4.140044 -0.852825
H  -7.345697 2.506903 -0.332752
H  -8.250137 3.290699 -1.626207
H  -3.183033 2.335956 -0.219904
H  1.402542 2.57984 1.292695
H  0.26325 1.435256 2.007333
H  -1.633486 1.042202 -3.36956
H  2.05297 0.665427 -1.206098
H  0.762761 0.436521 -3.317353
H  4.335132 0.014038 0.08382
H  4.114651 -2.264118 3.705527
H  6.70559 0.469486 0.516105
H  6.479098 -1.776581 4.149753
H  7.789847 -0.414513 2.555351
H  -0.648756 -1.965334 1.420751
H  0.06947 -1.95992 -0.189329
H  -0.89216 -3.359185 0.343138
totalener: -1384.97144243 hartree
nucrepener: 2761.95083887 hartree
electener: -4146.92228130 hartree
oneelecener: -7372.66887616 hartree
twoeener: 3225.74659486 hartree
kineticenergy: 1379.29477749 hartree
xcener: -132.292437956753 hartree
chargesum: 0.0000000
charge: -0.325409 -0.198742 -0.427907 -0.169722 -0.356668 0.079187 -0.152572 -0.167142 -0.146344 -0.105506 0.239463 -0.302190 -0.303007 -0.251784 0.493688 0.288602 0.120620 0.207926 0.079845 0.047921 -0.193288 0.067881 -0.202142 -0.091097 -0.159162 -0.144260 -0.139208 -0.138627 -0.109811 -0.127853 0.088673 0.118100 0.093833 0.094238 0.088752 0.118276 0.095843 0.096339 0.080585 0.151439 0.098660 0.098985 0.152766 0.123206 0.130669 0.119972 0.115871 0.122821 0.126190 0.126545 0.112258 0.107067 0.126216
qa: -0.3254 -0.1987 -0.4279 -0.1697 -0.3567 0.0792 -0.1526 -0.1671 -0.1463 -0.1055 0.2395 -0.3022 -0.3030 -0.2518 0.4937 0.2886 0.1206 0.2079 0.0798 0.0479 -0.1933 0.0679 -0.2021 -0.0911 -0.1592 -0.1443 -0.1392 -0.1386 -0.1098 -0.1279 0.0887 0.1181 0.0938 0.0942 0.0888 0.1183 0.0958 0.0963 0.0806 0.1514 0.0987 0.0990 0.1528 0.1232 0.1307 0.1200 0.1159 0.1228 0.1262 0.1265 0.1123 0.1071 0.1262
va: 2.1079 2.0208 2.0716 3.1771 3.0450 3.3543 2.8710 2.9502 2.7759 2.8478 3.8771 3.9075 3.9079 3.9107 4.2744 4.0524 3.8570 3.8179 3.5841 3.8972 3.9430 4.1945 3.9155 3.9745 4.0119 4.0341 3.9854 3.9841 3.9574 3.8598 1.0062 1.0193 1.0091 1.0089 1.0061 1.0188 1.0110 1.0108 1.0101 1.0528 0.9953 1.0251 1.0292 1.0099 1.0033 1.0069 1.0274 1.0036 1.0020 0.9994 0.9998 0.9941 1.0094
dispcorr: -0.025473854 hartree
energy: -1384.996916283209
dipole: -32.27100 31.13899 -1.13202 19.63323 -17.29106 2.34217 -13.83486 13.41500 -0.41986
magnitude: 2.63506 au
magnitude: 6.69778 debye
