program: Gaussian 09
title: 000064274
version: EM64L-G09RevD.01
frameworkgroup: C1[X(C20H35NO2)]
method: RPBEPBE
basis: SDD
operation: Freq
keyword: #p
keyword: freq=noraman
keyword: PBEPBE/SDD
title: #p freq=noraman PBEPBE/SDD
converged: NO YES NO NO
title: Mulliken charges:
elementType: O O N C C C C C C C C C C C C C C C C C C C C H H H H H H H H H H H H H H H H H H H H H H H H H H H H H H H H H H H
charge: -0.331535 -0.460269 -0.329841 0.403626 -0.098171 -0.103678 -0.103828 -0.536720 -0.515167 -0.517857 -0.449453 -0.448705 -0.447446 -0.347029 -0.269999 -0.109606 -0.422334 -0.057141 -0.404109 -0.438966 -0.393475 -0.391544 -0.385424 0.194669 0.196777 0.195088 0.198069 0.198467 0.215115 0.189131 0.223848 0.187921 0.196356 0.192198 0.196405 0.191506 0.193822 0.195248 0.187668 0.197304 0.217586 0.204310 0.205193 0.224556 0.218971 0.202544 0.178328 0.214838 0.215589 0.178184 0.234407 0.197691 0.189509 0.191421 0.197193 0.198259 0.187981 0.352522
chargesum: 0.00000
title: Mulliken charges with hydrogens summed into heavy atoms:
elementType: O O N C C C C C C C C C C C C C C C C C C C C
charge: -0.331535 -0.107747 -0.095435 0.403626 0.096498 0.093099 0.091260 -0.140183 -0.110921 -0.106088 -0.060900 -0.060795 -0.058377 0.037943 0.151897 0.095587 0.021193 0.145402 -0.010943 -0.045194 -0.006275 -0.002930 0.000817
polarizability: 2.41584363e+02 1.90318329e+00 2.10453534e+02 2.55647757e+00 4.71478995e-01 1.96397284e+02
1716.lowfreq: -7.7367 0.0003 0.0006 0.0008 6.7532 13.0415 16.7091 18.8224 38.9895
frequency: 12.0213 17.0771 38.5410 50.3621 64.3859 67.1745 89.0861 127.5917 151.6944 168.7714 194.9157 217.9048 235.8005 248.9997 261.3048 279.0021 297.0315 308.9496 330.6928 361.2955 375.4198 387.8653 396.4863 399.1552 414.8166 431.4203 432.9800 437.4865 447.7768 462.4698 475.1649 483.3204 566.3862 597.8680 627.7872 642.8600 645.6271 661.7456 710.2526 770.4146 784.3722 792.4406 801.7499 809.6513 841.6602 845.7342 873.5066 874.9561 877.3990 877.9809 888.9062 895.6962 900.6673 917.1536 919.0008 931.9827 945.4741 955.0637 961.3993 974.4711 984.7363 995.3463 1006.5299 1029.4547 1042.2763 1045.4326 1050.0399 1050.5484 1053.3887 1058.1293 1071.8060 1087.9800 1098.4909 1102.3257 1105.8284 1106.7641 1107.9529 1111.6613 1112.4361 1142.5235 1145.9763 1153.0359 1176.5632 1185.6005 1186.6047 1199.2552 1207.4949 1215.2729 1234.8422 1250.9075 1256.6063 1259.0860 1260.9123 1278.7099 1288.1940 1290.3460 1301.5758 1304.0876 1304.9246 1307.9375 1310.9156 1312.1371 1325.2422 1325.2869 1329.3350 1330.4031 1336.2716 1341.7258 1342.2990 1343.6312 1344.6755 1354.2795 1355.7312 1358.6294 1361.8510 1366.3919 1383.8013 1387.2648 1451.6770 1453.7553 1455.8913 1458.7767 1461.9151 1465.3361 1466.4510 1467.3190 1468.6203 1469.4363 1474.2181 1477.4280 1478.2545 1482.2620 1487.9378 2903.1514 2933.8747 2946.4698 2949.1303 2950.4961 2952.5826 2954.8423 2960.3455 2960.8510 2962.6147 2963.0571 2964.0360 2964.4433 2966.0937 2966.2540 2967.3147 2991.2010 2991.9018 3004.1187 3006.3832 3019.2592 3019.9086 3019.9650 3021.8597 3023.6953 3026.0592 3027.0902 3028.9416 3031.3732 3035.7487 3037.6851 3040.5978 3043.4375 3420.2454 3501.1229
redmass: 3.6382 4.4619 4.2916 2.8699 4.2097 4.2100 3.7161 3.4850 3.6643 3.1365 3.0585 2.3307 1.9667 2.2010 4.2350 3.5470 2.8997 1.9864 1.7997 2.0512 2.9370 2.4520 4.6590 4.0896 2.7119 1.7182 1.8017 2.5377 1.7676 2.0657 1.2777 2.4181 2.1582 3.2590 2.6308 3.8265 3.6809 1.6666 4.0701 3.4294 1.7356 1.7561 2.7096 2.7873 2.2207 3.0063 1.5923 1.5653 1.6456 1.6739 2.0597 1.7549 1.9461 2.0137 2.3506 2.7351 2.2280 2.3511 2.0179 2.1452 2.5735 2.2519 1.8195 4.5195 1.7858 2.5717 1.7969 1.7596 1.1381 1.6865 1.3721 2.4477 1.5557 1.9458 1.0937 1.2643 1.2339 2.5028 1.0111 3.1665 1.7507 3.0288 1.2756 1.4172 1.2629 1.4366 1.0667 1.3636 1.2375 1.2579 1.2951 1.5558 1.4670 1.7723 1.8589 1.8803 1.8530 1.2506 1.2807 2.1707 1.5704 1.6106 1.3134 1.3517 1.3133 1.2804 1.3785 1.4642 1.4708 1.4304 1.4438 1.4010 1.5127 1.5703 1.6268 1.4148 1.4560 1.3540 1.2223 1.0828 1.0814 1.0835 1.0909 1.0903 1.0897 1.0895 1.0891 1.0919 1.0817 1.0793 1.0805 1.0964 1.0899 1.0541 1.0665 1.0747 1.0600 1.0653 1.0569 1.0992 1.0657 1.0666 1.0619 1.0716 1.0626 1.0615 1.0606 1.0609 1.0661 1.0835 1.0840 1.0839 1.1017 1.1024 1.1026 1.1025 1.0906 1.0961 1.0967 1.1021 1.1001 1.0990 1.0987 1.0982 1.0933 1.1011 1.0737 1.0650
irintensity: 0.1028 0.0803 0.0882 0.0696 0.1648 0.8885 0.6557 0.5233 6.1520 3.5576 3.7539 2.5891 1.4907 0.4431 0.4916 1.9400 4.4256 0.0353 1.1797 0.0816 1.7408 1.0548 0.0226 0.2498 2.7473 0.0493 0.2932 0.4372 8.8020 12.6031 99.9900 33.5334 1.3956 1.3194 25.5322 0.0619 1.2241 66.1979 0.3300 1.1426 2.6375 0.7237 2.0144 4.4081 1.9480 15.3563 0.1095 0.3519 1.8527 2.7875 18.0442 7.6047 0.7520 2.9095 2.4152 10.5446 7.2915 2.2825 2.9840 5.1011 12.5523 11.4075 3.5763 126.6706 7.6465 53.3578 0.3510 0.1478 1.7223 1.0144 2.3756 89.8740 0.8826 17.9206 1.0652 8.6339 7.6104 0.2843 0.0005 50.9064 34.3364 11.5658 0.1959 2.4204 2.9234 3.9923 2.6293 22.4564 12.6981 7.2139 2.0847 4.4568 3.3594 0.0534 2.3623 0.2230 0.1006 0.3845 0.4572 5.7177 2.1185 1.6850 0.0137 9.4770 2.4961 6.3637 0.5548 0.4859 0.4421 4.0046 2.2984 0.5700 6.7294 0.8797 0.0170 16.0823 35.8042 3.4799 20.1038 0.9538 0.4383 14.5373 5.0140 9.9743 2.9091 21.4145 9.7108 21.3259 21.4474 13.5475 12.1477 3.5022 0.5373 44.8678 51.9344 5.3162 24.7436 21.9943 56.7268 17.1031 18.1481 61.0637 7.3724 60.9265 15.4354 36.6914 74.8992 48.2209 38.6005 149.4921 166.4617 50.7441 36.5605 22.1023 45.2651 8.1619 13.0779 94.3586 81.2015 97.8080 3.4261 24.0867 28.1381 68.1087 42.3414 139.1150 1.1953 34.3639
temp: 298.150 k
press: 1.00000 atm
elementType: 8 8 7 6 6 6 6 6 6 6 6 6 6 6 6 6 6 6 6 6 6 6 6 1 1 1 1 1 1 1 1 1 1 1 1 1 1 1 1 1 1 1 1 1 1 1 1 1 1 1 1 1 1 1 1 1 1 1
symmnumber: 1
zpe: 1372810.9 jmol-1
zpe.correction: 0.522876 hartree
zpe.thermalcorrener: 0.544880 hartree
zpe.thermalcorrenthalpy: 0.545825 hartree
zpe.thermalcorrgfe: 0.470174 hartree
zpe.sumelectzpe: -986.468526 hartree
zpe.sumelectthermal: -986.446521 hartree
zpe.sumelectthermalent: -986.445577 hartree
zpe.sumelectthermalfe: -986.521228 hartree
dipole: -0.2608 -2.1903 -1.6232
dipole: 2.7387
quadrupole: -131.3495 -151.7248 -142.6038
quadrupole: -0.7060 -0.4274 -6.3061
quadrupole: 10.5432 -9.8321 -0.7111 -0.7060 -0.4274 -6.3061
hfenergy: -986.9914017 hartree
pointgroup: C01 [X(C20H35N1O2)]
dipole: 0.0723141 0.8228105 -0.6918864 debye
polarizability: 241.2134083|1.4949247|210.3322098|-4.9619086|-1.3397826|196.8895623 unknown
InChI: InChI=1S/C20H35NO2/c22-19(12-21-18-4-2-1-3-5-18)13-23-14-20-9-15-6-16(10-20)8-17(7-15)11-20/h15-19,21-22H,1-14H2
charge 0 multiplicity 1
58 atoms
O  -0.458085 -1.418439 -0.271915
O  0.64664 -3.359473 1.272694
N  3.366401 -1.293851 -0.340865
C  -2.496638 -0.046961 -0.449666
C  -4.558318 1.42886 -0.755747
C  -4.544912 -0.361601 1.039726
C  -3.09969 1.708199 1.301158
C  -3.39183 0.705532 -1.480815
C  -3.379231 -1.080907 0.310092
C  -1.93474 0.985619 0.57138
C  -5.424641 0.384588 -0.000264
C  -3.980106 2.45161 0.259522
C  -3.96522 0.660978 2.054257
C  -1.362897 -0.75012 -1.214867
C  0.531586 -2.284203 -0.939638
C  1.451853 -2.798689 0.176464
C  2.392412 -1.685156 0.702818
C  3.925998 0.078747 -0.26396
C  4.781392 0.360866 1.005386
C  4.750323 0.372314 -1.538865
C  5.336171 1.806575 1.011068
C  5.317954 1.812119 -1.540303
C  6.154393 2.096429 -0.269713
H  -5.180927 1.958332 -1.504175
H  -5.158899 -1.111125 1.577402
H  -2.683112 2.436759 2.024843
H  -3.797789 -0.012466 -2.223669
H  -2.781362 1.444851 -2.040102
H  -2.755286 -1.63647 1.036229
H  -3.782859 -1.824463 -0.408514
H  -1.284128 0.466096 1.300111
H  -1.302112 1.72661 0.039591
H  -6.270131 0.890205 0.508123
H  -5.860593 -0.339394 -0.718434
H  -4.806487 2.985609 0.770532
H  -3.376828 3.215312 -0.272055
H  -4.789868 1.168317 2.59463
H  -3.350953 0.135834 2.813052
H  -1.789596 -1.503324 -1.916946
H  -0.781552 -0.010242 -1.811154
H  1.12951 -1.711025 -1.676829
H  0.005731 -3.123801 -1.441262
H  2.056811 -3.641668 -0.206451
H  2.850062 -2.050991 1.648353
H  1.778316 -0.79914 0.953917
H  3.058254 0.773469 -0.249138
H  5.628543 -0.358633 1.027331
H  4.177096 0.177008 1.915135
H  4.114136 0.198014 -2.42689
H  5.592368 -0.351996 -1.595963
H  4.114773 -1.993534 -0.451647
H  5.958053 1.973652 1.912014
H  4.48906 2.521842 1.071721
H  4.475996 2.533875 -1.589977
H  5.930414 1.975337 -2.448335
H  6.507488 3.146053 -0.271065
H  7.058892 1.452911 -0.276904
H  -0.135639 -2.752353 1.370174
