program: Orca
programVersion: 5.0.2
elementType: O O O N N N N N N N C C C C C C C C C C C C C C C C C C C C H H H H H H H H H H H H H H H H H H H H H H H
charge: 0
multiplicity: 1
keywords: wb97x-d3
keywords: def2-TZVPP
keywords: def2/J RIJCOSX
keywords: DEFGRID2
keywords: scfconv7
keywords: smallprint printgap noloewdin
keywords: NOSOSCF
formula: C20H23N7O3
InChI: InChI=1/C20H23N7O3/c1-20(2,3)30-19(28)22-16-12-8-11-15(21-16)13-29-24-17(14-9-6-5-7-10-14)18-23-25-26-27(18)4/h5-12,22H,13H2,1-4H3
53 atoms
O  -4.508602 0.47785 -2.638404
O  2.857499 -0.416436 -0.577396
O  -3.915199 2.421328 -1.637475
N  -2.395021 0.804572 -2.185308
N  -0.172992 0.506893 -1.931275
N  0.18891 -1.296329 2.457779
N  1.983482 -0.807089 0.372168
N  1.761621 -2.206365 3.595003
N  -0.346413 -1.819057 3.553504
N  0.598306 -2.358232 4.216146
C  -5.935402 0.738602 -2.706308
C  -6.225124 1.960296 -3.570719
C  -6.479522 -0.515628 -3.378616
C  -6.52872 0.878497 -1.308878
C  -3.651513 1.345454 -2.1094
C  -1.195506 1.329697 -1.730633
C  1.040027 0.86687 -1.544987
C  2.497205 -1.155086 1.485346
C  3.934529 -1.178472 1.832455
C  2.134939 -0.143672 -1.767828
C  -1.050922 2.57223 -1.112133
C  1.509453 -1.546587 2.490825
C  1.297676 2.087555 -0.937296
C  0.225045 2.937796 -0.722841
C  4.517529 -2.334054 2.345182
C  4.717659 -0.0406 1.652904
C  5.867023 -2.352522 2.65839
C  6.06243 -0.05879 1.982123
C  6.64141 -1.216516 2.480168
C  -0.643679 -0.589173 1.509783
H  -5.748643 1.869578 -4.548179
H  -5.894262 2.886227 -3.106336
H  -7.300792 2.035202 -3.736964
H  -7.560955 -0.438721 -3.488003
H  -6.051852 -0.652713 -4.372495
H  -6.26605 -1.407578 -2.788547
H  -6.202682 1.787161 -0.808665
H  -6.266507 0.022525 -0.685322
H  -7.616576 0.908485 -1.381266
H  -2.301592 -0.107631 -2.605638
H  1.697909 -1.057652 -2.177579
H  2.884466 0.227476 -2.469223
H  -1.894693 3.221365 -0.948151
H  2.300209 2.359579 -0.636457
H  0.378342 3.897848 -0.24735
H  3.916863 -3.217142 2.50847
H  4.275536 0.869054 1.269838
H  6.311057 -3.256784 3.052629
H  6.659109 0.83397 1.849608
H  7.693212 -1.231161 2.73385
H  -1.628613 -0.497885 1.956656
H  -0.239352 0.40013 1.30915
H  -0.707936 -1.129149 0.569803
totalener: -1384.97024002 hartree
nucrepener: 2816.24450207 hartree
electener: -4201.21474209 hartree
oneelecener: -7481.29908914 hartree
twoeener: 3280.08434706 hartree
kineticenergy: 1379.29424636 hartree
xcener: -132.291298055635 hartree
chargesum: -0.0000000
charge: -0.324847 -0.198154 -0.427236 -0.166943 -0.343475 0.082798 -0.136421 -0.172205 -0.145434 -0.108984 0.238987 -0.301985 -0.251030 -0.303913 0.494115 0.257953 0.088003 0.202092 0.070102 0.045158 -0.182213 0.085978 -0.164334 -0.096276 -0.146995 -0.157799 -0.137230 -0.132948 -0.113994 -0.139721 0.093946 0.118126 0.088816 0.080646 0.096213 0.096585 0.118546 0.094730 0.089447 0.152386 0.097765 0.101776 0.153964 0.119041 0.132046 0.117492 0.110205 0.126361 0.122831 0.126711 0.124391 0.107041 0.117886
qa: -0.3248 -0.1982 -0.4272 -0.1669 -0.3435 0.0828 -0.1364 -0.1722 -0.1454 -0.1090 0.2390 -0.3020 -0.2510 -0.3039 0.4941 0.2580 0.0880 0.2021 0.0701 0.0452 -0.1822 0.0860 -0.1643 -0.0963 -0.1470 -0.1578 -0.1372 -0.1329 -0.1140 -0.1397 0.0939 0.1181 0.0888 0.0806 0.0962 0.0966 0.1185 0.0947 0.0894 0.1524 0.0978 0.1018 0.1540 0.1190 0.1320 0.1175 0.1102 0.1264 0.1228 0.1267 0.1244 0.1070 0.1179
va: 2.1085 2.0143 2.0725 3.1722 3.0255 3.3542 2.8858 2.9396 2.7737 2.8473 3.8757 3.9074 3.9111 3.9079 4.2735 4.0429 3.9036 3.8312 3.5879 3.8670 3.9407 4.1693 3.9056 3.9789 4.0225 4.0167 3.9819 3.9694 3.9623 3.8734 1.0089 1.0188 1.0063 1.0100 1.0109 1.0110 1.0183 1.0089 1.0065 1.0522 1.0243 0.9943 1.0297 1.0124 1.0028 1.0328 1.0152 1.0019 1.0024 0.9993 1.0109 0.9950 0.9980
dispcorr: -0.026630457 hartree
energy: -1384.996870476675
dipole: -28.27061 28.02846 -0.24215 8.29838 -7.30391 0.99446 -18.40917 16.18766 -2.22151
magnitude: 2.44596 au
magnitude: 6.21713 debye
