program: Orca
programVersion: 5.0.2
elementType: O O O N N N N N N N C C C C C C C C C C C C C C C C C C C C H H H H H H H H H H H H H H H H H H H H H H H
charge: 0
multiplicity: 1
keywords: wb97x-d3
keywords: def2-TZVPP
keywords: def2/J RIJCOSX
keywords: DEFGRID2
keywords: scfconv7
keywords: smallprint printgap noloewdin
keywords: NOSOSCF
formula: C20H23N7O3
InChI: InChI=1/C20H23N7O3/c1-20(2,3)30-19(28)22-16-12-8-11-15(21-16)13-29-24-17(14-9-6-5-7-10-14)18-23-25-26-27(18)4/h5-12,22H,13H2,1-4H3
53 atoms
O  -5.02289 2.121542 -1.340103
O  2.317606 0.949931 1.23663
O  -3.824704 1.334189 -3.092735
N  -2.863485 1.875973 -1.091559
N  -0.781306 1.814871 -0.223185
N  0.745346 -2.878945 1.201889
N  1.782012 -0.286161 1.30421
N  2.568923 -3.651851 2.021909
N  0.589112 -4.182178 1.395508
N  1.677947 -4.625891 1.884982
C  -6.316662 2.119077 -1.998414
C  -6.318213 3.060487 -3.197238
C  -6.725511 0.70422 -2.389863
C  -7.250738 2.650413 -0.918112
C  -3.912075 1.737511 -1.96158
C  -1.521993 1.598643 -1.303341
C  0.523772 1.603325 -0.274225
C  2.602386 -1.227745 1.560783
C  4.058241 -1.104584 1.790998
C  1.27839 1.881816 0.999499
C  -0.98396 1.134609 -2.504443
C  1.988128 -2.554611 1.599832
C  1.164003 1.160746 -1.422784
C  0.382268 0.924169 -2.541877
C  4.63729 -1.654935 2.931171
C  4.86604 -0.447269 0.866414
C  6.000467 -1.536844 3.146966
C  6.230499 -0.344659 1.078371
C  6.800377 -0.885039 2.221342
C  -0.329427 -2.100203 0.627536
H  -7.337679 3.163322 -3.57095
H  -5.699932 2.695539 -4.01356
H  -5.971346 4.055376 -2.913904
H  -6.67803 0.031818 -1.532012
H  -7.757952 0.713846 -2.741371
H  -6.1066 0.297921 -3.186063
H  -7.251524 2.004178 -0.039631
H  -8.270624 2.697728 -1.298979
H  -6.964634 3.654632 -0.603262
H  -3.064054 2.217595 -0.163966
H  1.779064 2.850911 0.950246
H  0.572555 1.905078 1.83388
H  -1.603273 0.951133 -3.366165
H  2.233079 1.002166 -1.443092
H  0.83823 0.57191 -3.457925
H  4.026499 -2.184752 3.647791
H  4.435211 -0.028426 -0.03256
H  6.438534 -1.966501 4.037727
H  6.849751 0.158218 0.347699
H  7.866412 -0.803073 2.387299
H  -0.707061 -1.374293 1.341888
H  0.012748 -1.566634 -0.255806
H  -1.115872 -2.797436 0.356126
totalener: -1384.97094025 hartree
nucrepener: 2784.49665268 hartree
electener: -4169.46759293 hartree
oneelecener: -7417.78294438 hartree
twoeener: 3248.31535145 hartree
kineticenergy: 1379.29779495 hartree
xcener: -132.292847371505 hartree
chargesum: -0.0000000
charge: -0.325548 -0.200673 -0.428397 -0.170799 -0.346326 0.081094 -0.146284 -0.170757 -0.146354 -0.107205 0.240687 -0.304206 -0.301995 -0.251251 0.493861 0.280393 0.095193 0.200481 0.081305 0.052927 -0.187826 0.078311 -0.182766 -0.097378 -0.144831 -0.158089 -0.138214 -0.138591 -0.110997 -0.127449 0.088784 0.118821 0.093948 0.093819 0.088823 0.118174 0.096269 0.080550 0.095841 0.151998 0.097971 0.098462 0.154121 0.123712 0.131265 0.116315 0.114267 0.126017 0.123000 0.126748 0.112663 0.104387 0.125731
qa: -0.3255 -0.2007 -0.4284 -0.1708 -0.3463 0.0811 -0.1463 -0.1708 -0.1464 -0.1072 0.2407 -0.3042 -0.3020 -0.2513 0.4939 0.2804 0.0952 0.2005 0.0813 0.0529 -0.1878 0.0783 -0.1828 -0.0974 -0.1448 -0.1581 -0.1382 -0.1386 -0.1110 -0.1274 0.0888 0.1188 0.0939 0.0938 0.0888 0.1182 0.0963 0.0805 0.0958 0.1520 0.0980 0.0985 0.1541 0.1237 0.1313 0.1163 0.1143 0.1260 0.1230 0.1267 0.1127 0.1044 0.1257
va: 2.1088 2.0175 2.0705 3.1778 3.0393 3.3543 2.8748 2.9445 2.7756 2.8480 3.8748 3.9071 3.9083 3.9107 4.2737 4.0466 3.8931 3.8254 3.5719 3.8746 3.9400 4.1822 3.9119 3.9827 4.0264 4.0168 3.9830 3.9819 3.9597 3.8639 1.0063 1.0191 1.0089 1.0092 1.0063 1.0189 1.0109 1.0101 1.0109 1.0523 0.9950 1.0253 1.0291 1.0114 1.0033 1.0300 1.0105 1.0021 1.0029 0.9993 1.0001 0.9963 1.0097
dispcorr: -0.025950655 hartree
energy: -1384.996890904557
dipole: -31.48436 30.59214 -0.89222 16.99318 -14.63866 2.35452 -13.18214 12.60267 -0.57947
magnitude: 2.58371 au
magnitude: 6.56728 debye
