program: Orca
programVersion: 5.0.2
elementType: S S F F F F O N N C C C C C C C C C C C C C C C C C C C H H H H H H H H H H H H H H
charge: 0
multiplicity: 1
keywords: wb97x-d3
keywords: def2-TZVPP
keywords: def2/J RIJCOSX
keywords: DEFGRID2
keywords: scfconv7
keywords: smallprint printgap noloewdin
keywords: NOSOSCF
formula: C19H14F4N2OS2
InChI: InChI=1/C19H14F4N2OS2/c1-26-15-5-3-2-4-14(15)25-8-9-27-18(25)17(11-24)28-16-10-12(19(21,22)23)6-7-13(16)20/h2-7,10H,8-9H2,1H3
42 atoms
S  -0.116827 2.032122 2.008803
S  0.836807 2.352711 -0.907442
F  3.582829 2.781998 -1.454159
F  1.985248 -3.124698 -0.464607
F  3.856187 -3.099246 0.594187
F  2.064064 -2.387459 1.54886
O  -1.791779 -1.712077 0.388163
N  -2.227563 0.824864 1.168302
N  -1.698542 0.365522 -2.646964
C  -2.257366 0.593785 2.605202
C  -1.443944 1.719035 3.213226
C  -1.084416 1.373015 0.707535
C  -3.164699 0.162147 0.336346
C  -2.931944 -1.160452 -0.055513
C  -0.625958 1.444926 -0.580684
C  -4.301421 0.830133 -0.079089
C  -3.858286 -1.790402 -0.877044
C  -5.225437 0.199594 -0.896638
C  -4.992502 -1.106607 -1.290089
C  2.104649 1.132896 -0.720833
C  1.910727 -0.160842 -0.26728
C  2.991871 -1.025207 -0.124206
C  3.39956 1.530232 -1.028533
C  -1.252192 0.842452 -1.694506
C  4.27418 -0.606192 -0.443107
C  4.478863 0.686702 -0.901858
C  2.733589 -2.408773 0.387521
C  -1.455097 -3.006466 -0.060709
H  -1.823666 -0.381714 2.843913
H  -3.289822 0.606679 2.953529
H  -2.036532 2.624007 3.344016
H  -1.005651 1.440691 4.169076
H  -4.443279 1.857541 0.229957
H  -3.69907 -2.801169 -1.224529
H  -6.107571 0.726421 -1.231534
H  -5.697268 -1.608209 -1.939581
H  0.906044 -0.48676 -0.026729
H  5.121723 -1.267413 -0.337654
H  5.469171 1.03894 -1.156035
H  -1.324673 -3.034578 -1.145114
H  -2.20553 -3.746282 0.230539
H  -0.51369 -3.261835 0.413777
totalener: -2113.06772464 hartree
nucrepener: 3109.75755267 hartree
electener: -5222.82527732 hartree
oneelecener: -9092.83820277 hartree
twoeener: 3870.01292545 hartree
kineticenergy: 2106.70676215 hartree
xcener: -158.364494738689 hartree
chargesum: 0.0000000
charge: -0.003937 -0.015889 -0.191487 -0.180409 -0.173026 -0.182962 -0.311992 -0.020840 -0.034285 -0.061407 -0.132451 0.105612 -0.043934 0.198982 -0.002384 -0.111208 -0.128808 -0.108770 -0.103507 -0.006926 -0.093451 -0.125659 0.245264 -0.248550 -0.104915 -0.171659 0.556920 -0.163196 0.106921 0.102596 0.104346 0.110100 0.115998 0.112762 0.123315 0.124405 0.104052 0.136308 0.126508 0.125260 0.106889 0.115413
qa: -0.0039 -0.0159 -0.1915 -0.1804 -0.1730 -0.1830 -0.3120 -0.0208 -0.0343 -0.0614 -0.1325 0.1056 -0.0439 0.1990 -0.0024 -0.1112 -0.1288 -0.1088 -0.1035 -0.0069 -0.0935 -0.1257 0.2453 -0.2485 -0.1049 -0.1717 0.5569 -0.1632 0.1069 0.1026 0.1043 0.1101 0.1160 0.1128 0.1233 0.1244 0.1041 0.1363 0.1265 0.1253 0.1069 0.1154
va: 2.4593 2.4480 1.1140 1.1148 1.1331 1.1146 2.0766 3.1089 3.1541 3.9037 3.9789 4.0799 3.6737 4.0402 3.6888 4.0683 3.9352 3.9787 4.0217 3.8801 3.9359 3.8852 4.0052 4.0337 3.8976 3.9614 4.4126 3.8783 1.0112 0.9992 1.0109 1.0131 1.0185 1.0146 1.0029 1.0005 1.0216 1.0117 1.0074 0.9854 0.9881 1.0133
dispcorr: -0.025806755 hartree
energy: -2113.093531398116
dipole: -30.27038 29.39332 -0.87706 -2.56393 2.14117 -0.42276 6.19904 -4.09376 2.10529
magnitude: 2.31952 au
magnitude: 5.89576 debye
