program: Orca
programVersion: 5.0.2
elementType: S S F F F F O N N C C C C C C C C C C C C C C C C C C C H H H H H H H H H H H H H H
charge: 0
multiplicity: 1
keywords: wb97x-d3
keywords: def2-TZVPP
keywords: def2/J RIJCOSX
keywords: DEFGRID2
keywords: scfconv7
keywords: smallprint printgap noloewdin
keywords: NOSOSCF
formula: C19H14F4N2OS2
InChI: InChI=1/C19H14F4N2OS2/c1-26-15-5-3-2-4-14(15)25-8-9-27-18(25)17(11-24)28-16-10-12(19(21,22)23)6-7-13(16)20/h2-7,10H,8-9H2,1H3
42 atoms
S  -0.504674 2.821065 1.270391
S  0.923131 2.143884 -1.378387
F  3.72993 2.431163 -1.81219
F  1.922913 -2.044862 2.059078
F  1.832318 -3.079014 0.1783
F  3.687247 -2.991929 1.266509
O  -1.844628 -1.414451 0.992488
N  -2.385031 1.180303 0.649984
N  -1.364918 -0.384623 -2.733378
C  -2.909835 1.858371 1.823687
C  -1.701507 2.386003 2.570978
C  -1.209799 1.63997 0.184111
C  -3.173763 0.20918 -0.012319
C  -2.884194 -1.145016 0.188924
C  -0.568195 1.313241 -0.981237
C  -4.21916 0.593187 -0.832314
C  -3.662468 -2.099226 -0.455801
C  -4.994222 -0.360581 -1.471351
C  -4.704762 -1.700406 -1.279341
C  2.159194 0.999683 -0.8426
C  1.902634 -0.171616 -0.151915
C  2.946705 -1.014063 0.216204
C  3.481578 1.304462 -1.142266
C  -1.048218 0.381544 -1.928827
C  4.258074 -0.684516 -0.086763
C  4.527138 0.490711 -0.77222
C  2.60735 -2.284349 0.929238
C  -1.483169 -2.763749 1.188779
H  -3.480398 1.152697 2.427091
H  -3.578773 2.673808 1.529025
H  -1.933967 3.269845 3.16132
H  -1.268876 1.626265 3.22128
H  -4.407107 1.648402 -0.985569
H  -3.457259 -3.15438 -0.343079
H  -5.801694 -0.059932 -2.123591
H  -5.291745 -2.456941 -1.782664
H  0.876924 -0.423338 0.088998
H  5.0775 -1.328181 0.197495
H  5.540765 0.771626 -1.023629
H  -1.18153 -3.243277 0.254326
H  -2.294586 -3.3406 1.641941
H  -0.636306 -2.759257 1.867775
totalener: -2113.06750398 hartree
nucrepener: 3100.34081987 hartree
electener: -5213.40832385 hartree
oneelecener: -9074.05723898 hartree
twoeener: 3860.64891513 hartree
kineticenergy: 2106.70054365 hartree
xcener: -158.363640059828 hartree
chargesum: 0.0000000
charge: -0.011750 -0.019223 -0.191649 -0.186049 -0.176313 -0.173279 -0.304002 0.002555 -0.028447 -0.076286 -0.124554 0.102173 -0.091357 0.259847 -0.008810 -0.122710 -0.140494 -0.112569 -0.102096 -0.011227 -0.081122 -0.130287 0.249927 -0.248422 -0.104374 -0.170160 0.560574 -0.179498 0.105251 0.101404 0.108140 0.106406 0.115769 0.113459 0.123188 0.123911 0.099812 0.136519 0.125688 0.125180 0.112982 0.121895
qa: -0.0117 -0.0192 -0.1916 -0.1860 -0.1763 -0.1733 -0.3040 0.0026 -0.0284 -0.0763 -0.1246 0.1022 -0.0914 0.2598 -0.0088 -0.1227 -0.1405 -0.1126 -0.1021 -0.0112 -0.0811 -0.1303 0.2499 -0.2484 -0.1044 -0.1702 0.5606 -0.1795 0.1053 0.1014 0.1081 0.1064 0.1158 0.1135 0.1232 0.1239 0.0998 0.1365 0.1257 0.1252 0.1130 0.1219
va: 2.4481 2.4432 1.1132 1.1095 1.1194 1.1331 2.0883 3.0958 3.1578 3.9392 3.9686 4.0896 3.6898 4.0240 3.6963 4.0634 3.9271 3.9924 4.0203 3.8879 3.9191 3.8916 3.9975 4.0351 3.8956 3.9590 4.4023 3.8790 0.9981 0.9984 1.0128 1.0114 1.0130 1.0152 1.0030 1.0008 1.0256 1.0116 1.0077 0.9852 0.9879 1.0095
dispcorr: -0.025483980 hartree
energy: -2113.092987960029
dipole: -30.75286 29.59852 -1.15434 -0.64147 0.84152 0.20005 6.30323 -4.16003 2.14321
magnitude: 2.44251 au
magnitude: 6.20836 debye
