program: Gaussian 09
title: 000064278
version: EM64L-G09RevD.01
frameworkgroup: C1[X(C15H26N2O4S2)]
method: RPBEPBE
basis: SDD
operation: Freq
keyword: #p
keyword: freq=noraman
keyword: PBEPBE/SDD
title: #p freq=noraman PBEPBE/SDD
converged: NO YES NO NO
title: Mulliken charges:
elementType: S S O O O O N N C C C C C C C C C C C C C C C H H H H H H H H H H H H H H H H H H H H H H H H H H
charge: 0.101790 0.967023 -0.308339 -0.560987 -0.480808 -0.557086 -0.091107 -0.640707 0.371827 -0.098526 -0.090858 -0.099337 -0.499357 -0.541550 -0.509808 -0.448052 -0.448719 -0.447953 -0.268151 -0.431715 -0.467555 0.335101 -0.857448 0.207338 0.201682 0.198799 0.209920 0.200407 0.212410 0.216267 0.210758 0.210890 0.197034 0.194863 0.199149 0.193839 0.193578 0.197528 0.202838 0.219988 0.206951 0.208294 0.225868 0.228756 0.324260 0.306431 0.340579 0.385207 0.378692
chargesum: 0.00000
title: Mulliken charges with hydrogens summed into heavy atoms:
elementType: S S O O O O N N C C C C C C C C C C C C C C C
charge: 0.101790 0.967023 -0.308339 -0.182295 -0.480808 -0.557086 -0.091107 0.085079 0.371827 0.108812 0.110823 0.099462 -0.089031 -0.112874 -0.088161 -0.056156 -0.055731 -0.056847 0.154675 -0.016469 -0.012931 0.335101 -0.226756
polarizability: 5.39468989e+02 9.02695085e+01 2.91683027e+02 -2.77701568e+00 3.38948000e+00 1.97482739e+02
1716.lowfreq: -13.7518 -11.9294 -6.3384 0.0019 0.0019 0.0021 4.2385 7.5152 19.9912
frequency: -13.3562 7.0374 19.7187 32.1251 38.5332 57.0422 75.2066 106.5804 112.6465 124.9494 141.9828 144.7303 165.1758 179.0963 189.1984 230.1556 244.4849 258.6067 279.8867 283.8887 292.0644 296.0439 299.6251 328.4143 365.9238 375.5058 384.6241 388.4903 394.7945 400.1689 428.0178 442.8095 447.5528 477.1566 495.8835 510.3665 560.1341 593.9380 627.9709 633.8133 635.5811 702.0234 712.5087 754.8941 766.1867 770.9883 806.8445 808.8191 809.7822 837.3509 858.6250 869.9560 871.6549 878.5933 882.6183 896.5162 931.1425 934.6967 939.4278 944.5630 963.6502 968.0819 974.2092 977.8423 1030.4973 1034.1451 1034.9902 1043.2883 1045.1406 1046.6411 1066.0671 1094.3585 1098.0540 1100.6307 1102.7480 1104.0857 1109.9432 1113.5552 1164.6134 1176.9915 1179.3012 1193.7967 1194.8647 1237.6771 1260.0392 1268.9955 1276.1046 1279.5967 1281.4765 1285.3082 1294.0355 1305.6515 1308.8199 1322.5545 1328.3603 1339.6997 1340.5651 1344.6140 1352.1999 1357.8494 1358.3363 1358.6285 1371.1670 1405.3834 1434.6266 1442.1774 1449.6243 1453.7443 1461.4405 1465.3273 1466.9680 1473.1545 1486.2274 1584.1860 1650.5320 2898.1213 2955.0719 2960.5301 2965.6171 2966.8181 2967.6715 2972.7887 2975.3655 2982.9023 2997.0669 3000.9566 3004.7948 3011.3459 3020.7575 3022.7305 3023.8011 3028.0956 3032.0706 3033.6693 3040.5950 3047.5511 3067.3416 3099.0676 3308.8786 3454.6324 3616.7182
redmass: 8.2688 7.9320 6.4579 3.7135 5.6609 5.6719 5.2368 4.4448 5.2247 3.8331 5.0579 4.9364 3.5678 2.1839 3.2897 3.3679 3.4462 3.3535 5.3409 2.8069 3.5585 7.5266 2.0329 2.4326 2.5264 2.6075 2.7598 4.6704 3.2848 9.1277 1.8312 1.8680 1.8617 2.2758 1.6640 15.9954 2.1221 3.7148 4.4239 3.7618 3.7577 3.8782 6.0027 2.2103 1.6826 1.6855 2.7546 7.6486 2.7133 2.3415 2.2893 1.5688 1.5721 2.8846 1.5512 2.7471 16.4687 2.0318 2.2856 2.6255 2.2858 2.4154 2.1497 2.1285 2.3649 1.1618 1.7595 2.5337 2.0468 2.1103 2.0301 1.0302 1.3314 1.6196 1.2858 1.2901 1.0109 1.9522 1.4535 1.1678 1.1636 1.2186 1.1911 1.2074 1.6354 1.6632 1.6363 1.8623 1.4464 1.9302 2.0406 1.6876 1.6444 1.3142 1.3843 1.4572 1.4431 1.4351 1.4568 1.6012 1.6072 1.6750 2.1096 1.2531 1.0924 1.0927 1.0842 1.0832 1.0911 1.0885 1.0927 1.0778 1.0920 5.7949 1.1651 1.0574 1.0969 1.0587 1.0638 1.0605 1.0612 1.0597 1.0605 1.0626 1.0823 1.0829 1.0641 1.0831 1.0587 1.1031 1.1033 1.1012 1.1022 1.1033 1.1023 1.1025 1.1026 1.1038 1.0639 1.0660 1.0885
irintensity: 1.4475 0.3004 0.7467 0.2642 0.3595 0.9341 4.0914 3.0164 10.9687 5.9986 14.0073 27.0575 23.1358 91.3575 11.4269 20.2883 8.9851 4.0015 10.2970 7.9139 23.1553 16.5208 0.2992 5.6625 1.9104 5.6513 3.6343 0.1546 7.8700 25.4062 0.3071 4.4304 3.4729 0.5977 29.2012 287.3828 81.5483 11.8244 24.5407 0.3247 0.1378 11.1648 5.6119 21.7057 105.5693 96.7252 1.7580 79.1009 3.4115 6.0734 11.1646 0.2263 0.2226 0.3926 0.4374 0.2821 80.3496 4.2344 6.1779 17.6572 2.7188 12.0192 0.5495 3.3498 48.3794 50.5685 1.7356 35.3908 40.0401 27.2999 42.2621 0.6480 5.9183 12.0871 14.1627 7.7734 0.1427 8.6121 4.3015 3.3769 5.4283 8.4640 0.2210 13.1894 13.4941 2.6077 7.1309 17.9921 1.3138 0.0762 55.8756 17.5147 2.9645 0.0037 35.6445 3.8486 1.9400 7.3297 22.1370 23.8123 50.8478 35.5605 15.2799 43.9613 18.0631 14.2603 2.2276 1.8730 28.4831 16.2929 14.9308 9.2515 0.7274 45.4260 142.1763 37.5974 46.4864 37.2270 27.1577 26.3610 22.2570 11.6519 23.1691 48.6496 150.1546 120.9281 62.3066 48.3894 0.6615 5.9723 5.9174 54.3683 95.6326 4.3788 52.9019 47.8763 24.7735 5.4425 4.8575 102.7861 37.8527
temp: 298.150 k
press: 1.00000 atm
elementType: 16 16 8 8 8 8 7 7 6 6 6 6 6 6 6 6 6 6 6 6 6 6 6 1 1 1 1 1 1 1 1 1 1 1 1 1 1 1 1 1 1 1 1 1 1 1 1 1 1
symmnumber: 1
zpe: 1054894.8 jmol-1
zpe.correction: 0.401788 hartree
zpe.thermalcorrener: 0.425516 hartree
zpe.thermalcorrenthalpy: 0.426460 hartree
zpe.thermalcorrgfe: 0.346143 hartree
zpe.sumelectzpe: -1791.725334 hartree
zpe.sumelectthermal: -1791.701607 hartree
zpe.sumelectthermalent: -1791.700663 hartree
zpe.sumelectthermalfe: -1791.780980 hartree
dipole: 1.3587 2.2981 0.0926
dipole: 2.6713
quadrupole: -147.1606 -157.7650 -154.5009
quadrupole: -12.6607 -1.8875 2.6614
quadrupole: 5.9815 -4.6228 -1.3587 -12.6607 -1.8875 2.6614
hfenergy: -1792.1271224 hartree
pointgroup: C01 [X(C15H26N2O4S2)]
dipole: -0.3721564 0.9800402 0.0747071 debye
polarizability: 501.8816071|-126.6628106|328.9778292|-2.5435926|7.5587131|197.7753184 unknown
InChI: InChI=1S/C15H25N2OS.HO3S/c16-14(10-19)17-2-1-3-18-15-7-11-4-12(8-15)6-13(5-11)9-15;1-4(2)3/h11-13H,1-10,16H2;1H
charge 0 multiplicity 1
49 atoms
S  2.606516 -1.366628 1.225054
S  4.464524 -2.15926 -0.255413
O  -2.006539 2.116633 -0.214632
O  5.77303 -2.177877 1.081929
O  4.336487 -3.625613 -0.917579
O  4.86517 -0.916323 -1.241079
N  1.53313 2.04699 0.807036
N  3.014223 1.265111 -0.945654
C  -2.568852 0.74017 -0.179674
C  -2.057913 -1.743742 -0.248483
C  -3.984816 -0.803966 -1.605098
C  -4.147205 -0.904534 0.92455
C  -1.434801 -0.322186 -0.154261
C  -3.359669 0.6140 -1.501416
C  -3.5264 0.519343 1.020379
C  -2.855787 -1.870189 -1.575407
C  -3.013732 -1.966728 0.955026
C  -4.942579 -1.031851 -0.403578
C  -1.38789 2.621147 1.026579
C  -0.330313 3.6512 0.615428
C  0.841496 2.972369 -0.118086
C  2.534309 1.316346 0.350848
C  3.232756 0.413688 1.340859
H  -1.246726 -2.497103 -0.225954
H  -4.550119 -0.884621 -2.55405
H  -4.828272 -1.061049 1.784198
H  -0.833664 -0.230193 0.771352
H  -0.754468 -0.141632 -1.009269
H  -2.67586 0.805212 -2.350702
H  -4.145209 1.393315 -1.52692
H  -4.321488 1.290764 0.999962
H  -2.979249 0.623774 1.977576
H  -3.290812 -2.885923 -1.659853
H  -2.177036 -1.730884 -2.440518
H  -3.449232 -2.984702 0.9098
H  -2.449924 -1.894488 1.906836
H  -5.764924 -0.288844 -0.426851
H  -5.404895 -2.036653 -0.472258
H  -2.168612 3.083175 1.664597
H  -0.896538 1.805937 1.592474
H  0.050032 4.160643 1.52092
H  -0.795926 4.410873 -0.0403
H  1.543256 3.739175 -0.516213
H  0.415522 2.423028 -0.991105
H  2.99542 0.741144 2.36683
H  4.329289 0.391703 1.212615
H  2.552858 1.792385 -1.685436
H  3.754263 0.591008 -1.199877
H  6.654569 -2.375444 0.644618
