program: Orca
programVersion: 5.0.2
elementType: Cl Cl S F F F O O O O N N C C C C C C C C C C C C C H H H H H H H
charge: 0
multiplicity: 1
keywords: wb97x-d3
keywords: def2-TZVPP
keywords: def2/J RIJCOSX
keywords: DEFGRID2
keywords: scfconv7
keywords: smallprint printgap noloewdin
keywords: NOSOSCF
formula: C13H7Cl2F3N2O4S
InChI: InChI=1/C13H7Cl2F3N2O4S/c14-10-3-2-8(6-9(10)13(16,17)18)25(23,24)19-12-4-1-7(20(21)22)5-11(12)15/h1-6,19H
32 atoms
Cl -1.509066 3.727504 -2.146281
Cl 1.112447 -0.882001 3.137877
S  -1.344175 -2.230237 -0.309513
F  -4.045109 3.180351 -0.567211
F  -3.774351 2.026451 1.22169
F  -2.425026 3.633377 0.773829
O  -0.948787 -3.062443 -1.426024
O  -2.546208 -2.534008 0.439174
O  5.822073 -1.215528 -0.864857
O  5.854433 -0.436809 1.121885
N  -0.135414 -2.265212 0.838782
N  5.285933 -0.952054 0.186694
C  -1.408927 -0.547953 -0.85446
C  -2.185209 0.347364 -0.134326
C  -2.242913 1.674239 -0.524894
C  1.194105 -1.918146 0.630288
C  -0.683303 -0.145159 -1.963897
C  -1.496655 2.086047 -1.630995
C  -0.724538 1.184839 -2.344922
C  1.907723 -1.281976 1.657175
C  1.876297 -2.219036 -0.549176
C  -3.122646 2.633196 0.229347
C  3.881975 -1.275119 0.33415
C  3.242366 -0.967027 1.523579
C  3.20764 -1.893308 -0.704883
H  -2.751837 0.01016 0.72193
H  -0.504888 -2.082394 1.767552
H  -0.092643 -0.84099 -2.543467
H  -0.159354 1.513393 -3.205794
H  1.380759 -2.736372 -1.355271
H  3.764294 -0.483255 2.336656
H  3.704132 -2.146986 -1.62977
elementType: Cl S F O N C H
totalener: -2528.21319656 hartree
nucrepener: 2771.38015985 hartree
electener: -5299.59335640 hartree
oneelecener: -8992.07219105 hartree
twoeener: 3692.47883464 hartree
cpcmener: -0.03537412 hartree
kineticenergy: 2521.58979478 hartree
xcener: -168.161315106600 hartree
chargesum: -0.0000000
charge: -0.036085 -0.064463 0.880777 -0.171230 -0.172788 -0.170918 -0.498357 -0.513529 -0.392622 -0.394337 -0.166119 0.546321 -0.027238 -0.062024 -0.057495 0.124000 -0.088016 0.030140 -0.125833 0.020148 -0.220609 0.532171 0.006767 -0.038727 -0.072148 0.143058 0.180556 0.162020 0.151248 0.183093 0.146573 0.165667
qa: -0.0361 -0.0645 0.8808 -0.1712 -0.1728 -0.1709 -0.4984 -0.5135 -0.3926 -0.3943 -0.1661 0.5463 -0.0272 -0.0620 -0.0575 0.1240 -0.0880 0.0301 -0.1258 0.0201 -0.2206 0.5322 0.0068 -0.0387 -0.0721 0.1431 0.1806 0.1620 0.1512 0.1831 0.1466 0.1657
va: 1.2880 1.2634 5.8196 1.1269 1.1326 1.1272 1.9858 1.9903 1.8641 1.8634 3.0983 4.1384 3.7705 3.9652 3.7328 3.9444 3.9906 4.0335 4.0318 4.0297 4.0263 4.4565 3.8586 4.0548 4.0751 1.0340 1.0465 0.9961 1.0017 1.0022 1.0272 1.0116
dispcorr: -0.018115030 hartree
energy: -2528.231311588062
dipole: 15.22820 -15.47571 -0.24751 -18.42281 18.74037 0.31756 -6.31448 5.94336 -0.37112
magnitude: 0.54757 au
magnitude: 1.39181 debye
