program: Orca
programVersion: 5.0.2
elementType: Cl Cl S F F F O O O O N N C C C C C C C C C C C C C H H H H H H H
charge: 0
multiplicity: 1
keywords: wb97x-d3
keywords: def2-TZVPP
keywords: def2/J RIJCOSX
keywords: DEFGRID2
keywords: scfconv7
keywords: smallprint printgap noloewdin
keywords: NOSOSCF
formula: C13H7Cl2F3N2O4S
InChI: InChI=1/C13H7Cl2F3N2O4S/c14-10-3-2-8(6-9(10)13(16,17)18)25(23,24)19-12-4-1-7(20(21)22)5-11(12)15/h1-6,19H
32 atoms
Cl -2.500092 3.225971 -1.876405
Cl 1.017064 -2.349371 -2.356501
S  -1.719061 -2.291541 0.92573
F  0.048935 3.365624 -0.233599
F  -1.661454 3.781062 1.010702
F  -0.08318 2.51705 1.732557
O  -2.703261 -3.233477 0.438125
O  -1.536899 -2.064783 2.342814
O  4.784916 0.696369 1.495343
O  5.026246 0.415812 -0.606204
N  -0.268537 -2.834161 0.295335
N  4.430957 0.248428 0.431222
C  -1.974606 -0.718072 0.155611
C  -1.368243 0.400499 0.706362
C  -1.497001 1.628474 0.079158
C  0.89594 -2.064231 0.33779
C  -2.731763 -0.632952 -1.001023
C  -2.274333 1.719917 -1.075547
C  -2.891258 0.599184 -1.608607
C  1.601998 -1.775785 -0.836736
C  1.396462 -1.577536 1.54439
C  -0.797605 2.829462 0.650265
C  3.213976 -0.54473 0.400421
C  2.765138 -1.033846 -0.814576
C  2.537463 -0.802051 1.58068
H  -0.802776 0.321563 1.623581
H  -0.411633 -3.381823 -0.548655
H  -3.207978 -1.503362 -1.431696
H  -3.495476 0.684366 -2.501014
H  0.896583 -1.81412 2.471653
H  3.294934 -0.831965 -1.734726
H  2.895668 -0.429508 2.529151
elementType: Cl S F O N C H
totalener: -2528.21784180 hartree
nucrepener: 2863.88103520 hartree
electener: -5392.09887701 hartree
oneelecener: -9177.60177066 hartree
twoeener: 3785.50289366 hartree
cpcmener: -0.02925083 hartree
kineticenergy: 2521.60991621 hartree
xcener: -168.160553452247 hartree
chargesum: 0.0000000
charge: -0.033851 -0.060634 0.876993 -0.171101 -0.168945 -0.173880 -0.503943 -0.485978 -0.376292 -0.378010 -0.183308 0.535610 -0.028026 -0.060783 -0.069938 0.079961 -0.108687 0.030876 -0.114561 0.040110 -0.203512 0.534132 0.012913 -0.048975 -0.067810 0.155173 0.178169 0.155130 0.149201 0.177112 0.147460 0.165396
qa: -0.0339 -0.0606 0.8770 -0.1711 -0.1689 -0.1739 -0.5039 -0.4860 -0.3763 -0.3780 -0.1833 0.5356 -0.0280 -0.0608 -0.0699 0.0800 -0.1087 0.0309 -0.1146 0.0401 -0.2035 0.5341 0.0129 -0.0490 -0.0678 0.1552 0.1782 0.1551 0.1492 0.1771 0.1475 0.1654
va: 1.2908 1.2655 5.8313 1.1281 1.1314 1.1305 2.0035 1.9972 1.8827 1.8827 3.0567 4.1605 3.7909 3.8942 3.7546 3.8936 4.0152 4.0318 4.0056 4.0398 4.0419 4.4500 3.8574 4.0688 4.0235 1.0204 1.0433 1.0072 1.0016 1.0089 1.0274 1.0113
dispcorr: -0.019639765 hartree
energy: -2528.237481565774
dipole: 2.95617 -4.07283 -1.11666 -16.68522 15.81262 -0.87260 3.77616 -5.24457 -1.46841
magnitude: 2.04073 au
magnitude: 5.18713 debye
