program: Orca
programVersion: 5.0.2
elementType: Cl Cl S F F F O O O O N N C C C C C C C C C C C C C H H H H H H H
charge: 0
multiplicity: 1
keywords: wb97x-d3
keywords: def2-TZVPP
keywords: def2/J RIJCOSX
keywords: DEFGRID2
keywords: scfconv7
keywords: smallprint printgap noloewdin
keywords: NOSOSCF
formula: C13H7Cl2F3N2O4S
InChI: InChI=1/C13H7Cl2F3N2O4S/c14-10-3-2-8(6-9(10)13(16,17)18)25(23,24)19-12-4-1-7(20(21)22)5-11(12)15/h1-6,19H
32 atoms
Cl -1.981652 3.426715 0.900698
Cl -0.060791 -1.446531 2.803189
S  -1.662667 -2.562808 -0.775363
F  0.682149 2.908861 -0.532229
F  0.488681 1.80813 -2.366013
F  -0.874131 3.406463 -1.935372
O  -1.177968 -2.671034 -2.134832
O  -2.815127 -3.319771 -0.334521
O  4.459811 0.799055 -0.77545
O  4.014858 1.333003 1.241992
N  -0.409475 -3.012882 0.252085
N  3.829146 0.676061 0.246219
C  -1.877103 -0.843911 -0.406205
C  -1.10334 0.081268 -1.089619
C  -1.113408 1.40984 -0.697573
C  0.706386 -2.160831 0.305281
C  -2.694388 -0.464076 0.645452
C  -1.935682 1.793351 0.362029
C  -2.733866 0.86774 1.016157
C  0.953625 -1.342327 1.413006
C  1.554182 -2.067338 -0.793776
C  -0.205125 2.390036 -1.387094
C  2.772506 -0.323921 0.275518
C  1.987525 -0.427642 1.411702
C  2.576852 -1.138892 -0.82602
H  -0.487952 -0.233115 -1.919954
H  -0.760511 -3.347486 1.145568
H  -3.298066 -1.183022 1.183316
H  -3.372851 1.179629 1.830445
H  1.4066 -2.724189 -1.638644
H  2.151346 0.206475 2.271322
H  3.207232 -1.069817 -1.700293
elementType: Cl S F O N C H
totalener: -2528.21443611 hartree
nucrepener: 2961.92319164 hartree
electener: -5490.13762776 hartree
oneelecener: -9373.83391768 hartree
twoeener: 3883.69628992 hartree
cpcmener: -0.03004523 hartree
kineticenergy: 2521.61083741 hartree
xcener: -168.158674493417 hartree
chargesum: -0.0000000
charge: -0.032727 -0.055983 0.878203 -0.173493 -0.175981 -0.169339 -0.488064 -0.503196 -0.373576 -0.375490 -0.205591 0.551243 -0.010964 -0.037335 -0.099449 0.091376 -0.177817 0.042829 -0.099326 0.061199 -0.162408 0.552190 0.011678 -0.086432 -0.075785 0.156909 0.179037 0.157169 0.150278 0.157827 0.148389 0.164628
qa: -0.0327 -0.0560 0.8782 -0.1735 -0.1760 -0.1693 -0.4881 -0.5032 -0.3736 -0.3755 -0.2056 0.5512 -0.0110 -0.0373 -0.0994 0.0914 -0.1778 0.0428 -0.0993 0.0612 -0.1624 0.5522 0.0117 -0.0864 -0.0758 0.1569 0.1790 0.1572 0.1503 0.1578 0.1484 0.1646
va: 1.2928 1.2662 5.8168 1.1215 1.1289 1.1339 1.9989 2.0005 1.8869 1.8866 3.0470 4.1521 3.6957 3.8604 3.7260 3.8189 4.0281 4.0289 3.9735 4.0509 4.0414 4.4228 3.8191 4.0926 4.0041 1.0234 1.0367 1.0089 1.0000 1.0160 1.0284 1.0115
dispcorr: -0.022553357 hartree
energy: -2528.236989471985
dipole: 1.55822 -2.56799 -1.00977 -16.94676 16.20007 -0.74669 0.61994 0.98064 1.60058
magnitude: 2.03447 au
magnitude: 5.17120 debye
