program: Orca
programVersion: 5.0.2
elementType: Cl Cl S F F F O O O O N N C C C C C C C C C C C C C H H H H H H H
charge: 0
multiplicity: 1
keywords: wb97x-d3
keywords: def2-TZVPP
keywords: def2/J RIJCOSX
keywords: DEFGRID2
keywords: scfconv7
keywords: smallprint printgap noloewdin
keywords: NOSOSCF
formula: C13H7Cl2F3N2O4S
InChI: InChI=1/C13H7Cl2F3N2O4S/c14-10-3-2-8(6-9(10)13(16,17)18)25(23,24)19-12-4-1-7(20(21)22)5-11(12)15/h1-6,19H
32 atoms
Cl -1.663119 3.773371 -2.025772
Cl 1.264993 -0.89759 3.084194
S  -1.310326 -2.211626 -0.306733
F  -3.842692 1.946938 1.33897
F  -2.522553 3.587494 0.921032
F  -4.154514 3.147242 -0.410622
O  -0.928375 -3.008846 -1.451775
O  -2.476917 -2.550479 0.47952
O  5.954331 -0.477885 0.944109
O  5.854632 -1.213934 -1.057241
N  -0.063269 -2.228993 0.800224
N  5.355974 -0.968909 0.015797
C  -1.43412 -0.52193 -0.818345
C  -2.225578 0.337514 -0.071866
C  -2.324079 1.670491 -0.434279
C  1.264434 -1.901451 0.560841
C  -0.736963 -0.078904 -1.930553
C  -1.603139 2.123453 -1.541419
C  -0.818757 1.256331 -2.284336
C  2.014864 -1.288054 1.576407
C  1.912112 -2.194217 -0.640787
C  -3.212467 2.592882 0.356556
C  3.952858 -1.283159 0.19914
C  3.349383 -0.986928 1.410252
C  3.242513 -1.880033 -0.828463
H  -2.771519 -0.033843 0.784174
H  -0.401917 -2.084227 1.746784
H  -0.138139 -0.749098 -2.532068
H  -0.275927 1.616615 -3.147188
H  1.388477 -2.697094 -1.43851
H  3.899917 -0.520164 2.21473
H  3.711887 -2.125385 -1.769979
elementType: Cl S F O N C H
totalener: -2528.21890054 hartree
nucrepener: 2764.69582544 hartree
electener: -5292.91472598 hartree
oneelecener: -8978.88485249 hartree
twoeener: 3685.97012651 hartree
cpcmener: -0.02945927 hartree
kineticenergy: 2521.58186203 hartree
xcener: -168.158695088647 hartree
chargesum: -0.0000000
charge: -0.033686 -0.064545 0.871124 -0.172592 -0.169552 -0.169602 -0.486904 -0.500172 -0.381923 -0.380251 -0.166645 0.532685 -0.030959 -0.063930 -0.059271 0.119192 -0.089706 0.027436 -0.125630 0.018637 -0.216632 0.532578 0.003672 -0.042891 -0.075222 0.144162 0.177666 0.159147 0.149234 0.182613 0.147025 0.164944
qa: -0.0337 -0.0645 0.8711 -0.1726 -0.1696 -0.1696 -0.4869 -0.5002 -0.3819 -0.3803 -0.1666 0.5327 -0.0310 -0.0639 -0.0593 0.1192 -0.0897 0.0274 -0.1256 0.0186 -0.2166 0.5326 0.0037 -0.0429 -0.0752 0.1442 0.1777 0.1591 0.1492 0.1826 0.1470 0.1649
va: 1.2903 1.2634 5.8369 1.1327 1.1289 1.1295 1.9985 2.0077 1.8781 1.8789 3.0991 4.1624 3.7828 3.9628 3.7342 3.9507 3.9914 4.0414 4.0303 4.0311 4.0192 4.4557 3.8586 4.0554 4.0758 1.0344 1.0485 0.9979 1.0027 1.0035 1.0274 1.0126
dispcorr: -0.017993687 hartree
energy: -2528.236894228070
dipole: 15.55444 -15.84208 -0.28764 -18.15751 18.46322 0.30571 -7.02087 6.67413 -0.34674
magnitude: 0.54445 au
magnitude: 1.38389 debye
