program: Orca
programVersion: 5.0.2
elementType: Cl Cl S F F F O O O O N N C C C C C C C C C C C C C H H H H H H H
charge: 0
multiplicity: 1
keywords: wb97x-d3
keywords: def2-TZVPP
keywords: def2/J RIJCOSX
keywords: DEFGRID2
keywords: scfconv7
keywords: smallprint printgap noloewdin
keywords: NOSOSCF
formula: C13H7Cl2F3N2O4S
InChI: InChI=1/C13H7Cl2F3N2O4S/c14-10-3-2-8(6-9(10)13(16,17)18)25(23,24)19-12-4-1-7(20(21)22)5-11(12)15/h1-6,19H
32 atoms
Cl -1.484495 3.452545 -2.392499
Cl 0.9121 -0.962576 3.177105
S  -1.531534 -2.399097 -0.240147
F  -3.354793 3.323802 0.084852
F  -2.483955 2.240049 1.720385
F  -1.283552 3.616175 0.59811
O  -1.192806 -3.301297 -1.319572
O  -2.729517 -2.611474 0.544041
O  5.374236 -0.59693 -1.101033
O  5.442637 0.109536 0.911654
N  -0.300796 -2.402156 0.88748
N  4.885096 -0.443648 -0.006816
C  -1.515983 -0.744477 -0.86884
C  -1.877417 0.279151 -0.005406
C  -1.860732 1.588963 -0.449785
C  0.981677 -1.930262 0.644329
C  -1.1388 -0.489935 -2.174963
C  -1.493462 1.847722 -1.773269
C  -1.133068 0.819253 -2.626802
C  1.671843 -1.238079 1.649756
C  1.626626 -2.129357 -0.577151
C  -2.24702 2.697962 0.490486
C  3.547571 -0.957521 0.216461
C  2.948771 -0.758846 1.449868
C  2.896119 -1.637043 -0.799194
H  -2.169318 0.055924 1.01194
H  -0.651669 -2.316549 1.836427
H  -0.856161 -1.285468 -2.850405
H  -0.84683 1.03343 -3.647223
H  1.150584 -2.693851 -1.36483
H  3.456297 -0.228964 2.243479
H  3.366289 -1.808034 -1.756589
elementType: Cl S F O N C H
totalener: -2528.21866452 hartree
nucrepener: 2817.38459993 hartree
electener: -5345.60326445 hartree
oneelecener: -9084.24122645 hartree
twoeener: 3738.63796200 hartree
cpcmener: -0.03009321 hartree
kineticenergy: 2521.59777868 hartree
xcener: -168.160660512807 hartree
chargesum: -0.0000000
charge: -0.032888 -0.063727 0.874704 -0.168790 -0.172680 -0.169598 -0.488575 -0.499910 -0.380035 -0.380909 -0.176541 0.532745 -0.002219 -0.090547 -0.058499 0.129914 -0.104900 0.031078 -0.105547 0.026778 -0.232895 0.530530 0.001414 -0.042027 -0.072968 0.131737 0.183650 0.159993 0.149551 0.179242 0.147158 0.164762
qa: -0.0329 -0.0637 0.8747 -0.1688 -0.1727 -0.1696 -0.4886 -0.4999 -0.3800 -0.3809 -0.1765 0.5327 -0.0022 -0.0905 -0.0585 0.1299 -0.1049 0.0311 -0.1055 0.0268 -0.2329 0.5305 0.0014 -0.0420 -0.0730 0.1317 0.1837 0.1600 0.1496 0.1792 0.1472 0.1648
va: 1.2913 1.2628 5.8333 1.1302 1.1327 1.1295 2.0025 2.0009 1.8792 1.8795 3.0997 4.1624 3.7015 3.9733 3.7421 3.8967 3.9860 4.0357 4.0010 4.0248 4.0273 4.4593 3.8648 4.0569 4.0794 1.0367 1.0442 1.0065 1.0013 1.0032 1.0271 1.0127
dispcorr: -0.018829958 hartree
energy: -2528.237494480169
dipole: 10.76878 -11.22740 -0.45862 -18.69620 18.62401 -0.07219 -7.53012 7.02641 -0.50371
magnitude: 0.68503 au
magnitude: 1.74122 debye
