program: Orca
programVersion: 5.0.2
elementType: Cl Cl S F F F O O O O N N C C C C C C C C C C C C C H H H H H H H
charge: 0
multiplicity: 1
keywords: wb97x-d3
keywords: def2-TZVPP
keywords: def2/J RIJCOSX
keywords: DEFGRID2
keywords: scfconv7
keywords: smallprint printgap noloewdin
keywords: NOSOSCF
formula: C13H7Cl2F3N2O4S
InChI: InChI=1/C13H7Cl2F3N2O4S/c14-10-3-2-8(6-9(10)13(16,17)18)25(23,24)19-12-4-1-7(20(21)22)5-11(12)15/h1-6,19H
32 atoms
Cl -2.351779 3.038354 -2.146411
Cl 0.568929 -1.714245 -2.242709
S  -1.722136 -2.283165 1.05259
F  0.268895 3.190385 -0.627595
F  -1.344999 3.751407 0.68462
F  0.220568 2.454711 1.386852
O  -2.736803 -3.219331 0.634305
O  -1.447677 -1.975069 2.434656
O  4.701176 0.8307 -0.454264
O  4.764101 0.605168 1.674936
N  -0.292718 -2.876701 0.384354
N  4.283726 0.397099 0.589967
C  -1.960158 -0.750727 0.191705
C  -1.248578 0.365975 0.60259
C  -1.335129 1.547697 -0.115795
C  0.853303 -2.072254 0.424668
C  -2.790428 -0.701253 -0.915112
C  -2.175792 1.599039 -1.228085
C  -2.903356 0.483798 -1.617913
C  1.363338 -1.471576 -0.730605
C  1.500474 -1.843228 1.635736
C  -0.543128 2.748383 0.331772
C  3.095974 -0.454559 0.536412
C  2.490586 -0.6745 -0.687653
C  2.610828 -1.024094 1.701782
H  -0.634136 0.317896 1.490092
H  -0.473343 -3.319511 -0.509508
H  -3.357433 -1.569545 -1.221921
H  -3.558536 0.548042 -2.475048
H  1.123005 -2.316767 2.529891
H  2.876663 -0.223047 -1.589771
H  3.100463 -0.847127 2.647658
totalener: -2528.19819578 hartree
nucrepener: 2917.97522342 hartree
electener: -5446.17341920 hartree
oneelecener: -9286.63074206 hartree
twoeener: 3840.45732286 hartree
kineticenergy: 2521.66984845 hartree
xcener: -168.162805709861 hartree
chargesum: -0.0000000
charge: -0.012947 -0.049965 0.859483 -0.159973 -0.155455 -0.170257 -0.450256 -0.437571 -0.327786 -0.325368 -0.187515 0.504186 -0.093635 -0.072824 -0.082761 0.043810 -0.112925 0.022803 -0.105693 0.071782 -0.146094 0.542471 -0.024604 -0.104007 -0.069608 0.154968 0.146286 0.149467 0.130752 0.147869 0.153252 0.162118
qa: -0.0129 -0.0500 0.8595 -0.1600 -0.1555 -0.1703 -0.4503 -0.4376 -0.3278 -0.3254 -0.1875 0.5042 -0.0936 -0.0728 -0.0828 0.0438 -0.1129 0.0228 -0.1057 0.0718 -0.1461 0.5425 -0.0246 -0.1040 -0.0696 0.1550 0.1463 0.1495 0.1308 0.1479 0.1533 0.1621
va: 1.3127 1.2784 5.8503 1.1443 1.1525 1.1337 2.0611 2.0515 1.9273 1.9289 3.0635 4.1819 3.8890 3.8236 3.7447 3.8717 4.0054 4.0917 4.0039 3.9969 4.0596 4.4370 3.9351 4.0820 4.0371 1.0211 1.0659 1.0131 1.0102 1.0220 1.0266 1.0152
dispcorr: -0.021239855 hartree
energy: -2528.219435631407
dipole: 2.49064 -3.30232 -0.81168 -17.50171 16.79583 -0.70588 5.43595 -6.56571 -1.12975
magnitude: 1.55995 au
magnitude: 3.96508 debye
