program: Orca
programVersion: 5.0.2
elementType: Cl Cl S F F F O O O O N N C C C C C C C C C C C C C H H H H H H H
charge: 0
multiplicity: 1
keywords: wb97x-d3
keywords: def2-TZVPP
keywords: def2/J RIJCOSX
keywords: DEFGRID2
keywords: scfconv7
keywords: smallprint printgap noloewdin
keywords: NOSOSCF
formula: C13H7Cl2F3N2O4S
InChI: InChI=1/C13H7Cl2F3N2O4S/c14-10-3-2-8(6-9(10)13(16,17)18)25(23,24)19-12-4-1-7(20(21)22)5-11(12)15/h1-6,19H
32 atoms
Cl -1.859495 3.531973 1.424565
Cl 1.491935 -0.486298 -2.315094
S  -1.637023 -2.46838 -0.289772
F  -0.459605 3.339783 -1.28638
F  -1.460551 2.077625 -2.710021
F  -2.596556 3.45328 -1.515852
O  -2.449606 -2.717542 -1.455324
O  -1.739441 -3.257457 0.914756
O  4.379698 -0.702454 3.15752
O  4.939597 0.437457 1.432342
N  -0.05815 -2.576834 -0.85993
N  4.2368 -0.351217 2.01337
C  -1.767027 -0.76177 0.188239
C  -1.697901 0.217625 -0.790649
C  -1.712706 1.555938 -0.435739
C  1.004184 -2.026968 -0.14313
C  -1.880879 -0.427691 1.525711
C  -1.831714 1.893308 0.914689
C  -1.924587 0.90803 1.884224
C  1.81949 -1.043679 -0.713718
C  1.28068 -2.445333 1.156768
C  -1.560989 2.617724 -1.493839
C  3.119162 -0.92912 1.271583
C  2.884187 -0.500951 -0.023088
C  2.325129 -1.8922 1.870979
H  -1.625747 -0.062823 -1.832233
H  -0.020939 -2.45482 -1.8647
H  -1.937139 -1.195186 2.284721
H  -2.020686 1.188953 2.923326
H  0.679687 -3.22545 1.600422
H  3.506551 0.252578 -0.483368
H  2.52888 -2.225334 2.877736
totalener: -2528.19833259 hartree
nucrepener: 2871.26275152 hartree
electener: -5399.46108411 hartree
oneelecener: -9192.97619722 hartree
twoeener: 3793.51511311 hartree
kineticenergy: 2521.66193831 hartree
xcener: -168.162556653724 hartree
chargesum: 0.0000000
charge: -0.011777 -0.054676 0.855693 -0.157812 -0.168613 -0.155718 -0.441060 -0.446449 -0.328095 -0.328290 -0.207570 0.496154 0.043311 -0.188079 -0.061765 0.086537 -0.128256 0.020830 -0.102988 0.032839 -0.195450 0.535766 -0.042173 -0.060995 -0.060377 0.138779 0.159533 0.153445 0.131831 0.167454 0.156082 0.161893
qa: -0.0118 -0.0547 0.8557 -0.1578 -0.1686 -0.1557 -0.4411 -0.4464 -0.3281 -0.3283 -0.2076 0.4962 0.0433 -0.1881 -0.0618 0.0865 -0.1283 0.0208 -0.1030 0.0328 -0.1955 0.5358 -0.0422 -0.0610 -0.0604 0.1388 0.1595 0.1534 0.1318 0.1675 0.1561 0.1619
va: 1.3132 1.2750 5.8498 1.1449 1.1359 1.1519 2.0601 2.0490 1.9252 1.9261 3.0649 4.1887 3.7307 3.9703 3.7582 3.9051 4.0249 4.0960 3.9977 4.0219 4.0713 4.4566 3.9557 4.0567 4.0386 1.0379 1.0625 1.0135 1.0103 1.0115 1.0234 1.0151
dispcorr: -0.020169478 hartree
energy: -2528.218502065355
dipole: 5.89101 -6.22038 -0.32938 -19.62902 19.55818 -0.07084 11.53303 -11.38276 0.15027
magnitude: 0.36890 au
magnitude: 0.93768 debye
