program: Orca
programVersion: 5.0.2
elementType: Cl Cl S F F F O O O O N N C C C C C C C C C C C C C H H H H H H H
charge: 0
multiplicity: 1
keywords: wb97x-d3
keywords: def2-TZVPP
keywords: def2/J RIJCOSX
keywords: DEFGRID2
keywords: scfconv7
keywords: smallprint printgap noloewdin
keywords: NOSOSCF
formula: C13H7Cl2F3N2O4S
InChI: InChI=1/C13H7Cl2F3N2O4S/c14-10-3-2-8(6-9(10)13(16,17)18)25(23,24)19-12-4-1-7(20(21)22)5-11(12)15/h1-6,19H
32 atoms
Cl -1.052012 3.764376 -1.543245
Cl 0.598052 -0.035714 2.299072
S  -1.380641 -2.362942 -0.419968
F  -3.750777 1.864245 1.364365
F  -2.194814 3.343756 1.28231
F  -3.723018 3.293917 -0.238228
O  -0.883945 -3.064607 -1.57849
O  -2.622724 -2.697779 0.232251
O  5.64782 -1.23524 -1.077169
O  5.357356 0.361974 0.320176
N  -0.210129 -2.499439 0.786791
N  4.99328 -0.623005 -0.271617
C  -1.366235 -0.628909 -0.795518
C  -2.163991 0.231099 -0.058352
C  -2.094836 1.597697 -0.277244
C  1.085464 -2.031167 0.535623
C  -0.503062 -0.149931 -1.767294
C  -1.208948 2.081991 -1.241124
C  -0.426789 1.213033 -1.985785
C  1.588186 -0.894733 1.177613
C  1.904787 -2.699881 -0.370449
C  -2.948625 2.535066 0.535748
C  3.644743 -1.114621 0.007515
C  2.867434 -0.436393 0.929198
C  3.178149 -2.241756 -0.648195
H  -2.845709 -0.169256 0.679207
H  -0.591267 -2.246104 1.691432
H  0.100732 -0.826226 -2.35618
H  0.242082 1.607021 -2.737486
H  1.535129 -3.593861 -0.850264
H  3.241708 0.441524 1.435018
H  3.803496 -2.768398 -1.353577
totalener: -2528.19856276 hartree
nucrepener: 2854.04428933 hartree
electener: -5382.24285209 hartree
oneelecener: -9158.57934323 hartree
twoeener: 3776.33649114 hartree
kineticenergy: 2521.65838284 hartree
xcener: -168.160265040849 hartree
chargesum: 0.0000000
charge: -0.012467 -0.047287 0.862347 -0.167215 -0.157957 -0.156393 -0.443772 -0.444041 -0.326125 -0.327833 -0.195410 0.497596 -0.032255 -0.144288 -0.049486 0.044197 -0.108783 0.023534 -0.121476 0.051864 -0.139663 0.534689 -0.032199 -0.077663 -0.075565 0.150678 0.148816 0.145005 0.132559 0.150021 0.155268 0.163304
qa: -0.0125 -0.0473 0.8623 -0.1672 -0.1580 -0.1564 -0.4438 -0.4440 -0.3261 -0.3278 -0.1954 0.4976 -0.0323 -0.1443 -0.0495 0.0442 -0.1088 0.0235 -0.1215 0.0519 -0.1397 0.5347 -0.0322 -0.0777 -0.0756 0.1507 0.1488 0.1450 0.1326 0.1500 0.1553 0.1633
va: 1.3124 1.2803 5.8481 1.1389 1.1442 1.1503 2.0501 2.0651 1.9266 1.9262 3.0585 4.1863 3.8096 3.9418 3.7149 3.8880 3.9967 4.1007 4.0114 4.0209 4.0558 4.4568 3.9405 4.0659 4.0364 1.0361 1.0635 1.0102 1.0104 1.0205 1.0254 1.0144
dispcorr: -0.020401762 hartree
energy: -2528.218964521588
dipole: 14.91615 -14.86224 0.05391 -20.09964 20.13174 0.03210 -6.48732 6.55763 0.07031
magnitude: 0.09423 au
magnitude: 0.23952 debye
