program: Orca
programVersion: 5.0.2
elementType: N N N N C C C C C C C C C C C C C C C H H H H H H H H H H H H H H H H H H
charge: 0
multiplicity: 1
keywords: wb97x-d3
keywords: def2-TZVPP
keywords: def2/J RIJCOSX
keywords: DEFGRID2
keywords: scfconv7
keywords: smallprint printgap noloewdin
keywords: NOSOSCF
formula: C15H18N4
InChI: InChI=1/C15H18N4/c1-10-7-5-6-8-14(10)13(4)18-19-15-16-11(2)9-12(3)17-15/h5-9,19H,1-4H3
37 atoms
N  -0.21907 1.291206 0.599837
N  0.280111 0.145493 0.114224
N  1.938315 -1.190516 -0.653263
N  2.403537 1.061077 -0.051279
C  -2.413709 0.217928 0.742313
C  -3.060649 -0.012601 -0.478631
C  -1.457526 1.350309 0.89253
C  -2.670183 -0.602048 1.837317
C  -3.96365 -1.069467 -0.558169
C  -2.798011 0.862105 -1.668898
C  -3.570596 -1.652638 1.739038
C  -4.220586 -1.88318 0.536276
C  -2.001293 2.630084 1.43466
C  3.211408 -1.371514 -0.977189
C  3.680245 0.875803 -0.373367
C  1.59876 0.017986 -0.204889
C  4.13963 -0.344641 -0.848487
C  3.619198 -2.717021 -1.48273
C  4.608849 2.035291 -0.212154
H  -2.160416 -0.415202 2.775189
H  -4.474164 -1.257663 -1.495304
H  -3.093772 1.896449 -1.479524
H  -1.740673 0.875912 -1.940965
H  -3.354483 0.516235 -2.539402
H  -3.761918 -2.284631 2.596538
H  -4.927474 -2.698252 0.446514
H  -2.811395 3.005761 0.804498
H  -2.425581 2.47992 2.430417
H  -1.227093 3.393649 1.498123
H  5.179238 -0.491221 -1.109812
H  -0.298819 -0.680549 0.007951
H  4.353895 -3.173019 -0.816769
H  2.764221 -3.385437 -1.560583
H  4.088256 -2.636804 -2.464472
H  5.459665 1.768779 0.416548
H  5.013481 2.342989 -1.1781
H  4.100401 2.887413 0.233979
elementType: N C H
totalener: -801.52017051 hartree
nucrepener: 1351.95789785 hartree
electener: -2153.47806836 hartree
oneelecener: -3769.66504811 hartree
twoeener: 1616.18697975 hartree
cpcmener: -0.02450872 hartree
kineticenergy: 797.92903310 hartree
xcener: -79.590633582290 hartree
chargesum: -0.0000000
charge: -0.223056 -0.003485 -0.423015 -0.373994 -0.029757 -0.081803 0.113922 -0.147939 -0.119600 -0.222970 -0.172794 -0.157433 -0.223170 0.158723 0.161209 0.359391 -0.244060 -0.234288 -0.239514 0.144014 0.140035 0.105135 0.099921 0.093641 0.157259 0.157330 0.095689 0.097906 0.096120 0.137252 0.171323 0.106374 0.092736 0.105087 0.104530 0.106083 0.093200
qa: -0.2231 -0.0035 -0.4230 -0.3740 -0.0298 -0.0818 0.1139 -0.1479 -0.1196 -0.2230 -0.1728 -0.1574 -0.2232 0.1587 0.1612 0.3594 -0.2441 -0.2343 -0.2395 0.1440 0.1400 0.1051 0.0999 0.0936 0.1573 0.1573 0.0957 0.0979 0.0961 0.1373 0.1713 0.1064 0.0927 0.1051 0.1045 0.1061 0.0932
va: 2.9962 3.0514 3.0283 3.0413 3.5481 3.8006 3.8712 3.9261 3.8756 3.9247 3.9032 3.9034 3.8926 3.9303 3.9135 4.2490 3.8666 3.9025 3.9079 1.0040 1.0001 0.9937 1.0014 1.0061 0.9914 0.9901 0.9994 0.9980 1.0207 0.9980 1.0422 0.9971 1.0228 0.9974 0.9976 0.9971 1.0228
dispcorr: -0.014889769 hartree
energy: -801.535060279242
dipole: 0.75016 -0.93605 -0.18588 1.98633 -2.65319 -0.66685 -3.25067 2.90417 -0.34650
magnitude: 0.77415 au
magnitude: 1.96773 debye
