program: Orca
programVersion: 5.0.2
elementType: N N N C C C C C C C C C C C C C H H H H H H H H H H H H H H H H H H H H H H H H H H H H H
charge: 0
multiplicity: 1
keywords: wb97x-d3
keywords: def2-TZVPP
keywords: def2/J RIJCOSX
keywords: DEFGRID2
keywords: scfconv7
keywords: smallprint printgap noloewdin
keywords: NOSOSCF
formula: C13H29N3
InChI: InChI=1/C13H29N3/c1-2-3-4-5-6-7-8-9-10-11-12-16-13(14)15/h2-12,14-15H2,1H3
45 atoms
N  -2.12249 3.776037 1.069519
N  -3.326627 5.639151 0.252794
N  -3.427105 5.045087 2.477431
C  -0.189573 -2.623661 0.873241
C  0.63942 -3.088977 -0.319255
C  -1.101767 -1.433977 0.589293
C  1.457085 -4.338243 -0.0095
C  -0.372346 -0.139652 0.248784
C  2.173631 -4.937477 -1.217314
C  -1.31602 1.047833 0.103561
C  3.166509 -4.014072 -1.919078
C  -0.600172 2.356246 -0.203692
C  4.305637 -3.526014 -1.032408
C  -1.527112 3.564053 -0.227082
C  5.337793 -2.712466 -1.798512
C  -2.911025 4.769409 1.228172
H  0.478832 -2.376405 1.706039
H  -0.803323 -3.460934 1.221661
H  1.30429 -2.283928 -0.645866
H  -0.028254 -3.29135 -1.165412
H  -1.731567 -1.259602 1.468043
H  -1.789264 -1.690604 -0.224761
H  0.792542 -5.102027 0.40793
H  2.178023 -4.112058 0.782989
H  0.360719 0.077446 1.034597
H  0.202557 -0.26214 -0.674746
H  2.698428 -5.845234 -0.901489
H  1.42341 -5.264833 -1.944667
H  -2.04485 0.840024 -0.688847
H  -1.894903 1.163384 1.024508
H  2.642618 -3.151245 -2.34389
H  3.589665 -4.55077 -2.774742
H  -0.096692 2.28046 -1.173025
H  0.187498 2.528196 0.538079
H  4.794205 -4.386873 -0.563917
H  3.909087 -2.92137 -0.211514
H  -0.943806 4.435742 -0.562479
H  -2.285705 3.401664 -1.008832
H  4.889521 -1.824673 -2.250038
H  6.147239 -2.374631 -1.149102
H  5.786954 -3.297306 -2.604259
H  -3.649602 6.546522 0.550463
H  -2.784102 5.67342 -0.594639
H  -4.350589 5.451111 2.494211
H  -3.336525 4.277837 3.124853
elementType: N C H
totalener: -677.23160987 hartree
nucrepener: 1067.75124291 hartree
electener: -1744.98285277 hartree
oneelecener: -3034.19040903 hartree
twoeener: 1289.20755626 hartree
cpcmener: -0.02280922 hartree
kineticenergy: 673.77911853 hartree
xcener: -69.478377356598 hartree
chargesum: 0.0000000
charge: -0.453351 -0.326219 -0.308223 -0.139310 -0.119929 -0.121980 -0.137034 -0.116534 -0.159487 -0.114778 -0.132980 -0.088695 -0.084500 -0.078934 -0.278528 0.301695 0.063503 0.070638 0.062743 0.062291 0.070315 0.060667 0.073538 0.068749 0.057493 0.059028 0.074304 0.071529 0.054253 0.050629 0.065451 0.073717 0.062550 0.047646 0.058273 0.056951 0.082238 0.081676 0.077797 0.089221 0.076787 0.172151 0.180629 0.166740 0.167278
qa: -0.4534 -0.3262 -0.3082 -0.1393 -0.1199 -0.1220 -0.1370 -0.1165 -0.1595 -0.1148 -0.1330 -0.0887 -0.0845 -0.0789 -0.2785 0.3017 0.0635 0.0706 0.0627 0.0623 0.0703 0.0607 0.0735 0.0687 0.0575 0.0590 0.0743 0.0715 0.0543 0.0506 0.0655 0.0737 0.0626 0.0476 0.0583 0.0570 0.0822 0.0817 0.0778 0.0892 0.0768 0.1722 0.1806 0.1667 0.1673
va: 2.9320 3.1529 3.0818 3.9042 3.8504 3.8917 3.8688 3.8745 3.9171 3.8502 3.8656 3.8733 3.8538 3.9593 3.9481 4.3270 1.0081 1.0122 1.0031 1.0101 1.0115 1.0094 1.0125 1.0014 1.0095 1.0086 1.0084 1.0082 1.0117 1.0466 1.0015 1.0096 1.0170 1.0269 1.0075 1.0045 0.9955 0.9918 1.0007 1.0037 1.0018 1.0123 1.0121 1.0113 1.0250
dispcorr: -0.015710948 hartree
energy: -677.247320816261
dipole: 14.59588 -15.52499 -0.92911 -19.47676 20.76373 1.28697 -6.88163 6.48468 -0.39695
magnitude: 1.63619 au
magnitude: 4.15885 debye
