program: Orca
programVersion: 5.0.2
elementType: N N N C C C C C C C C C C C C C H H H H H H H H H H H H H H H H H H H H H H H H H H H H H
charge: 0
multiplicity: 1
keywords: wb97x-d3
keywords: def2-TZVPP
keywords: def2/J RIJCOSX
keywords: DEFGRID2
keywords: scfconv7
keywords: smallprint printgap noloewdin
keywords: NOSOSCF
formula: C13H29N3
InChI: InChI=1/C13H29N3/c1-2-3-4-5-6-7-8-9-10-11-12-16-13(14)15/h2-12,14-15H2,1H3
45 atoms
N  -1.241071 3.79911 0.360642
N  -2.4541 5.439123 1.559643
N  -0.319874 5.859521 0.79494
C  -1.189515 -2.955038 -0.744167
C  -0.03198 -3.761449 -0.159951
C  -1.435267 -1.615894 -0.05802
C  1.341126 -3.122661 -0.342713
C  -2.651846 -0.883604 -0.613994
C  2.468757 -3.998308 0.193826
C  -2.976175 0.42955 0.094413
C  3.859144 -3.375645 0.096594
C  -1.905506 1.501223 -0.065196
C  4.357119 -3.159208 -1.328327
C  -2.298699 2.836206 0.549276
C  5.78168 -2.626545 -1.376918
C  -1.360308 4.958514 0.88465
H  -2.102793 -3.555826 -0.681296
H  -1.011999 -2.788906 -1.812727
H  -0.022568 -4.751905 -0.626778
H  -0.21422 -3.934626 0.906632
H  -0.548735 -0.983681 -0.155214
H  -1.575273 -1.7814 1.016724
H  1.375411 -2.152309 0.162915
H  1.496852 -2.916972 -1.406733
H  -2.500898 -0.688289 -1.681727
H  -3.522036 -1.545078 -0.549268
H  2.261337 -4.23285 1.243009
H  2.466051 -4.958684 -0.333939
H  -3.924394 0.813895 -0.296259
H  -3.147299 0.234587 1.159108
H  4.570615 -4.0221 0.621126
H  3.86924 -2.420479 0.633597
H  -1.6957 1.650247 -1.129725
H  -0.967039 1.173381 0.39032
H  3.696933 -2.465511 -1.856043
H  4.302875 -4.105865 -1.875829
H  -3.242217 3.16784 0.089599
H  -2.532313 2.671555 1.613963
H  6.120372 -2.479292 -2.403718
H  5.865296 -1.666021 -0.86421
H  6.48105 -3.314748 -0.897512
H  -2.293872 6.190324 2.212428
H  -3.111515 4.758575 1.904084
H  -0.580323 6.832146 0.728594
H  0.366911 5.604125 0.102989
elementType: N C H
totalener: -677.23208558 hartree
nucrepener: 1061.88593551 hartree
electener: -1739.11802109 hartree
oneelecener: -3022.31906741 hartree
twoeener: 1283.20104632 hartree
cpcmener: -0.02334097 hartree
kineticenergy: 673.77981894 hartree
xcener: -69.477012944521 hartree
chargesum: 0.0000000
charge: -0.444257 -0.325897 -0.306628 -0.133954 -0.132579 -0.113419 -0.122431 -0.145790 -0.126947 -0.137199 -0.130411 -0.043111 -0.078218 -0.077138 -0.284133 0.291429 0.069992 0.061172 0.071755 0.061231 0.068289 0.057828 0.060654 0.062549 0.062716 0.070716 0.069649 0.061410 0.068601 0.059780 0.069156 0.058808 0.047993 0.043343 0.057041 0.055079 0.079675 0.062587 0.088974 0.078514 0.077971 0.172159 0.179451 0.167200 0.166389
qa: -0.4443 -0.3259 -0.3066 -0.1340 -0.1326 -0.1134 -0.1224 -0.1458 -0.1269 -0.1372 -0.1304 -0.0431 -0.0782 -0.0771 -0.2841 0.2914 0.0700 0.0612 0.0718 0.0612 0.0683 0.0578 0.0607 0.0625 0.0627 0.0707 0.0696 0.0614 0.0686 0.0598 0.0692 0.0588 0.0480 0.0433 0.0570 0.0551 0.0797 0.0626 0.0890 0.0785 0.0780 0.1722 0.1795 0.1672 0.1664
va: 2.9556 3.1491 3.0808 3.9036 3.9023 3.8560 3.8579 3.9138 3.9027 3.9184 3.8960 3.7937 3.8546 3.9909 3.9501 4.3477 1.0117 1.0093 1.0102 1.0105 1.0032 1.0095 1.0078 1.0069 1.0080 1.0117 1.0099 1.0103 1.0128 1.0094 1.0095 1.0090 1.0244 1.0312 1.0072 1.0065 0.9937 0.9923 1.0038 1.0003 1.0014 1.0121 1.0130 1.0107 1.0256
dispcorr: -0.015205140 hartree
energy: -677.247290715784
dipole: 9.09528 -9.83084 -0.73556 -20.26732 21.45945 1.19213 -3.50552 4.26246 0.75693
magnitude: 1.59222 au
magnitude: 4.04711 debye
