program: Orca
programVersion: 5.0.2
elementType: N N N C C C C C C C C C C C C C H H H H H H H H H H H H H H H H H H H H H H H H H H H H H
charge: 0
multiplicity: 1
keywords: wb97x-d3
keywords: def2-TZVPP
keywords: def2/J RIJCOSX
keywords: DEFGRID2
keywords: scfconv7
keywords: smallprint printgap noloewdin
keywords: NOSOSCF
formula: C13H29N3
InChI: InChI=1/C13H29N3/c1-2-3-4-5-6-7-8-9-10-11-12-16-13(14)15/h2-12,14-15H2,1H3
45 atoms
N  -2.236543 3.333208 0.024327
N  -2.040976 4.280993 2.18554
N  -0.368955 4.533538 0.623872
C  -0.344913 -1.128146 -0.180928
C  0.61347 -2.301803 -0.342898
C  -1.80495 -1.55757 -0.090027
C  2.073779 -1.877004 -0.430201
C  -2.780006 -0.4130 0.175473
C  3.038543 -3.046492 -0.584127
C  -2.894988 0.585657 -0.971931
C  4.493734 -2.603167 -0.682431
C  -3.896118 1.70902 -0.719689
C  5.486505 -3.73803 -0.917732
C  -3.4767 2.685908 0.373452
C  5.577608 -4.733585 0.230335
C  -1.609823 4.004422 0.912467
H  -0.20721 -0.436195 -1.017561
H  -0.079676 -0.567008 0.722494
H  0.346502 -2.867412 -1.24259
H  0.486056 -2.992836 0.497799
H  -1.902978 -2.297642 0.711006
H  -2.091539 -2.073869 -1.013169
H  2.338026 -1.306045 0.466922
H  2.200485 -1.189636 -1.273896
H  -3.771727 -0.832276 0.376045
H  -2.478973 0.099637 1.095157
H  2.908943 -3.730008 0.26096
H  2.775117 -3.618848 -1.480988
H  -1.920193 1.029449 -1.188774
H  -3.189162 0.044075 -1.876794
H  4.771375 -2.064114 0.230363
H  4.585884 -1.87958 -1.498871
H  -4.869776 1.283349 -0.456367
H  -4.047827 2.270295 -1.646394
H  6.476844 -3.308454 -1.093096
H  5.220783 -4.266395 -1.838915
H  -4.287241 3.416934 0.503732
H  -3.420969 2.14128 1.328859
H  4.637222 -5.262114 0.39336
H  6.341363 -5.488908 0.037784
H  5.839902 -4.234642 1.166022
H  -1.331458 4.463898 2.877707
H  -2.802002 3.725981 2.541416
H  -0.155697 5.420285 1.055417
H  -0.156745 4.53017 -0.361308
elementType: N C H
totalener: -677.23148766 hartree
nucrepener: 1079.68888378 hartree
electener: -1756.92037144 hartree
oneelecener: -3058.05526522 hartree
twoeener: 1301.13489378 hartree
cpcmener: -0.02248094 hartree
kineticenergy: 673.78722142 hartree
xcener: -69.479437610082 hartree
chargesum: 0.0000000
charge: -0.452390 -0.328659 -0.309083 -0.108098 -0.118831 -0.132909 -0.109551 -0.140667 -0.119466 -0.109279 -0.110912 -0.126183 -0.112555 -0.075249 -0.276854 0.303949 0.060211 0.056471 0.057977 0.056170 0.069284 0.060351 0.056914 0.056793 0.071769 0.063117 0.060272 0.057361 0.048769 0.073983 0.060355 0.066208 0.061341 0.063779 0.068782 0.053799 0.100331 0.065860 0.079778 0.090449 0.078570 0.173076 0.181524 0.167139 0.166302
qa: -0.4524 -0.3287 -0.3091 -0.1081 -0.1188 -0.1329 -0.1096 -0.1407 -0.1195 -0.1093 -0.1109 -0.1262 -0.1126 -0.0752 -0.2769 0.3039 0.0602 0.0565 0.0580 0.0562 0.0693 0.0604 0.0569 0.0568 0.0718 0.0631 0.0603 0.0574 0.0488 0.0740 0.0604 0.0662 0.0613 0.0638 0.0688 0.0538 0.1003 0.0659 0.0798 0.0904 0.0786 0.1731 0.1815 0.1671 0.1663
va: 2.9178 3.1560 3.0831 3.8732 3.8920 3.9099 3.8891 3.9032 3.8762 3.8212 3.8789 3.8948 3.8984 3.9221 3.9278 4.3209 1.0093 1.0102 1.0096 1.0118 1.0100 1.0099 1.0098 1.0118 1.0102 1.0038 1.0080 1.0089 1.0492 1.0098 1.0086 1.0116 1.0161 1.0228 1.0068 1.0086 0.9986 0.9903 0.9987 1.0044 1.0009 1.0114 1.0130 1.0112 1.0256
dispcorr: -0.015774175 hartree
energy: -677.247261836389
dipole: 11.31569 -11.09086 0.22483 -18.79569 19.53348 0.73779 -1.50339 2.85346 1.35007
magnitude: 1.55486 au
magnitude: 3.95213 debye
