program: Orca
programVersion: 5.0.2
elementType: N N N C C C C C C C C C C C C C H H H H H H H H H H H H H H H H H H H H H H H H H H H H H
charge: 0
multiplicity: 1
keywords: wb97x-d3
keywords: def2-TZVPP
keywords: def2/J RIJCOSX
keywords: DEFGRID2
keywords: scfconv7
keywords: smallprint printgap noloewdin
keywords: NOSOSCF
formula: C13H29N3
InChI: InChI=1/C13H29N3/c1-2-3-4-5-6-7-8-9-10-11-12-16-13(14)15/h2-12,14-15H2,1H3
45 atoms
N  -3.378937 4.385901 0.316673
N  -1.690877 4.753663 1.945261
N  -2.521569 6.486746 0.681479
C  -0.651846 -2.617515 -0.672804
C  0.786961 -2.425313 -0.206186
C  -1.667085 -1.712889 0.020251
C  1.757906 -3.404321 -0.854911
C  -1.489279 -0.228145 -0.274591
C  3.197797 -3.227304 -0.388845
C  -2.573266 0.639934 0.35224
C  4.165756 -4.208617 -1.037767
C  -2.396879 2.121648 0.048791
C  5.606431 -4.037037 -0.572485
C  -3.482983 2.993539 0.676714
C  6.563681 -5.019941 -1.229396
C  -2.568255 5.137493 0.960448
H  -0.939318 -3.661032 -0.506886
H  -0.707578 -2.459327 -1.755791
H  0.830052 -2.540118 0.883075
H  1.117438 -1.403239 -0.416471
H  -1.620781 -1.878211 1.102627
H  -2.673888 -2.014622 -0.286757
H  1.713152 -3.290716 -1.943858
H  1.433102 -4.42952 -0.644681
H  -0.511859 0.111868 0.081597
H  -1.486829 -0.075086 -1.35981
H  3.524368 -2.202891 -0.599844
H  3.242431 -3.340744 0.700093
H  -3.555375 0.309614 -0.003983
H  -2.577772 0.486795 1.437446
H  4.122172 -4.094596 -2.126725
H  3.838581 -5.233227 -0.828199
H  -2.40415 2.278727 -1.034547
H  -1.41242 2.448109 0.399368
H  5.653143 -4.154532 0.514779
H  5.935719 -3.014032 -0.780337
H  -4.454484 2.628022 0.330232
H  -3.489176 2.82357 1.76584
H  6.285508 -6.053103 -1.011355
H  6.568893 -4.904992 -2.31532
H  7.587721 -4.876798 -0.880627
H  -1.430063 5.461604 2.614456
H  -1.861448 3.861236 2.381239
H  -1.61649 6.924939 0.767198
H  -2.979339 6.731236 -0.182699
elementType: N C H
totalener: -677.23303701 hartree
nucrepener: 1039.96579427 hartree
electener: -1717.19883128 hartree
oneelecener: -2977.98764223 hartree
twoeener: 1260.78881095 hartree
cpcmener: -0.02349149 hartree
kineticenergy: 673.78506552 hartree
xcener: -69.477122542219 hartree
chargesum: -0.0000000
charge: -0.462641 -0.324819 -0.306369 -0.131806 -0.113175 -0.131611 -0.119776 -0.107423 -0.102868 -0.131606 -0.111038 -0.108851 -0.078926 -0.030762 -0.281760 0.297321 0.071266 0.061572 0.057198 0.060747 0.060592 0.070669 0.057855 0.057579 0.061191 0.058533 0.056378 0.055547 0.058195 0.058064 0.055263 0.055594 0.057654 0.057572 0.053562 0.053777 0.081482 0.057886 0.077327 0.077222 0.089602 0.167774 0.183039 0.167226 0.165748
qa: -0.4626 -0.3248 -0.3064 -0.1318 -0.1132 -0.1316 -0.1198 -0.1074 -0.1029 -0.1316 -0.1110 -0.1089 -0.0789 -0.0308 -0.2818 0.2973 0.0713 0.0616 0.0572 0.0607 0.0606 0.0707 0.0579 0.0576 0.0612 0.0585 0.0564 0.0555 0.0582 0.0581 0.0553 0.0556 0.0577 0.0576 0.0536 0.0538 0.0815 0.0579 0.0773 0.0772 0.0896 0.1678 0.1830 0.1672 0.1657
va: 2.9570 3.1366 3.0796 3.9034 3.8730 3.9007 3.8949 3.8624 3.8810 3.9040 3.8811 3.8199 3.8770 3.9793 3.9481 4.3350 1.0110 1.0091 1.0099 1.0099 1.0093 1.0113 1.0095 1.0111 1.0099 1.0097 1.0107 1.0107 1.0128 1.0097 1.0087 1.0086 1.0231 1.0237 1.0070 1.0071 1.0029 1.0076 1.0008 1.0008 1.0042 1.0140 1.0087 1.0112 1.0260
dispcorr: -0.015015212 hartree
energy: -677.248052220880
dipole: 17.08698 -15.97568 1.11130 -24.02340 24.36405 0.34065 -3.37375 4.38935 1.01560
magnitude: 1.54353 au
magnitude: 3.92335 debye
