program: Orca
programVersion: 5.0.2
elementType: N N N C C C C C C C C C C C C C H H H H H H H H H H H H H H H H H H H H H H H H H H H H H
charge: 0
multiplicity: 1
keywords: wb97x-d3
keywords: def2-TZVPP
keywords: def2/J RIJCOSX
keywords: DEFGRID2
keywords: scfconv7
keywords: smallprint printgap noloewdin
keywords: NOSOSCF
formula: C13H29N3
InChI: InChI=1/C13H29N3/c1-2-3-4-5-6-7-8-9-10-11-12-16-13(14)15/h2-12,14-15H2,1H3
45 atoms
N  -0.327371 1.87035 -0.241909
N  0.134529 4.169474 -0.541002
N  1.261544 2.557821 -1.750313
C  -1.612369 -2.242389 -0.969232
C  -0.501186 -3.291002 -0.983602
C  -2.34942 -2.137869 0.362078
C  0.657205 -3.018441 -0.025221
C  -3.432609 -1.05938 0.390527
C  1.405274 -1.718899 -0.297361
C  -2.927294 0.364521 0.160639
C  2.536608 -1.467541 0.691241
C  -1.979918 0.882153 1.238479
C  3.271944 -0.156589 0.445557
C  -1.25629 2.156953 0.825398
C  4.367901 0.1079 1.466737
C  0.303032 2.833204 -0.798645
H  -2.336246 -2.486122 -1.754017
H  -1.194513 -1.270895 -1.245821
H  -0.104544 -3.370282 -2.001156
H  -0.93018 -4.271479 -0.751919
H  -1.637609 -1.959909 1.172727
H  -2.811064 -3.105577 0.585813
H  1.363334 -3.853008 -0.086402
H  0.295305 -3.016769 1.007894
H  -4.186094 -1.293197 -0.36885
H  -3.953582 -1.106547 1.352714
H  1.80698 -1.738088 -1.317042
H  0.717713 -0.868675 -0.261736
H  -2.434057 0.427373 -0.812464
H  -3.788099 1.03843 0.098354
H  3.249852 -2.298732 0.655583
H  2.12839 -1.463756 1.708402
H  -1.222981 0.131376 1.482403
H  -2.540059 1.064489 2.160611
H  2.551306 0.666359 0.46128
H  3.702561 -0.162547 -0.560676
H  -2.008482 2.908211 0.538043
H  -0.745413 2.571391 1.707167
H  4.875233 1.055263 1.277225
H  3.96346 0.15079 2.48028
H  5.125629 -0.678363 1.450338
H  0.898278 4.781517 -0.782384
H  -0.296211 4.41234 0.336069
H  1.377049 3.247349 -2.477654
H  1.195276 1.621748 -2.118585
elementType: N C H
totalener: -677.22905933 hartree
nucrepener: 1186.59300193 hartree
electener: -1863.82206126 hartree
oneelecener: -3272.40834906 hartree
twoeener: 1408.58628780 hartree
cpcmener: -0.02147113 hartree
kineticenergy: 673.78610155 hartree
xcener: -69.483982657952 hartree
chargesum: 0.0000000
charge: -0.459540 -0.320958 -0.309857 -0.129678 -0.160322 -0.136543 -0.138407 -0.153170 -0.057709 -0.145697 -0.123022 -0.097730 -0.057529 -0.077769 -0.287564 0.320979 0.078623 0.058458 0.072343 0.072610 0.066877 0.076100 0.075758 0.065284 0.070087 0.070110 0.065756 -0.012740 0.065761 0.078222 0.058988 0.056061 0.054376 0.077042 0.029439 0.055839 0.072344 0.089323 0.089155 0.077447 0.079542 0.170756 0.180014 0.164732 0.176209
qa: -0.4595 -0.3210 -0.3099 -0.1297 -0.1603 -0.1365 -0.1384 -0.1532 -0.0577 -0.1457 -0.1230 -0.0977 -0.0575 -0.0778 -0.2876 0.3210 0.0786 0.0585 0.0723 0.0726 0.0669 0.0761 0.0758 0.0653 0.0701 0.0701 0.0658 -0.0127 0.0658 0.0782 0.0590 0.0561 0.0544 0.0770 0.0294 0.0558 0.0723 0.0893 0.0892 0.0774 0.0795 0.1708 0.1800 0.1647 0.1762
va: 2.8659 3.1810 3.0932 3.8382 3.9300 3.8624 3.8908 3.9343 3.8268 3.8405 3.8809 3.8433 3.8737 3.9529 3.9595 4.2515 1.0108 1.0126 1.0078 1.0093 1.0025 1.0115 1.0109 1.0026 1.0083 1.0073 1.0135 1.0599 1.0253 1.0105 1.0104 1.0074 1.0210 1.0164 1.0236 1.0056 0.9942 0.9950 1.0041 1.0005 1.0009 1.0131 1.0114 1.0137 1.0160
dispcorr: -0.019847058 hartree
energy: -677.248906388681
dipole: 2.89787 -2.53227 0.36560 -9.04085 10.65616 1.61531 3.84752 -4.20396 -0.35645
magnitude: 1.69409 au
magnitude: 4.30603 debye
