program: Orca
programVersion: 5.0.2
elementType: N N N C C C C C C C C C C C C C H H H H H H H H H H H H H H H H H H H H H H H H H H H H H
charge: 0
multiplicity: 1
keywords: wb97x-d3
keywords: def2-TZVPP
keywords: def2/J RIJCOSX
keywords: DEFGRID2
keywords: scfconv7
keywords: smallprint printgap noloewdin
keywords: NOSOSCF
formula: C13H29N3
InChI: InChI=1/C13H29N3/c1-2-3-4-5-6-7-8-9-10-11-12-16-13(14)15/h2-12,14-15H2,1H3
45 atoms
N  -3.421929 4.235932 0.663656
N  -2.36081 6.148001 1.566139
N  -4.479245 6.277801 0.666427
C  -0.539709 -2.617432 -0.350508
C  0.582634 -3.61903 -0.092257
C  -0.286149 -1.221397 0.208589
C  1.893145 -3.295377 -0.800329
C  -1.468198 -0.2825 0.002787
C  2.964357 -4.357118 -0.581481
C  -1.242772 1.119877 0.555318
C  4.275542 -4.04653 -1.292214
C  -2.441466 2.034062 0.342489
C  5.346886 -5.107845 -1.074452
C  -2.238685 3.440211 0.885874
C  6.653355 -4.787848 -1.784945
C  -3.393477 5.478913 0.959981
H  -1.46495 -3.007012 0.086571
H  -0.722513 -2.549214 -1.42878
H  0.247019 -4.611378 -0.411032
H  0.75972 -3.694089 0.98644
H  0.603241 -0.784659 -0.256281
H  -0.063652 -1.297117 1.279098
H  2.275833 -2.327896 -0.460554
H  1.704701 -3.186928 -1.874521
H  -1.693822 -0.215181 -1.067276
H  -2.358627 -0.715007 0.472311
H  3.151283 -4.466955 0.492538
H  2.587793 -5.327647 -0.923397
H  -1.015559 1.056313 1.625404
H  -0.35693 1.558819 0.082779
H  4.653431 -3.076552 -0.950203
H  4.089145 -3.936424 -2.366338
H  -3.324692 1.595402 0.817752
H  -2.667812 2.098071 -0.726785
H  4.97204 -6.076687 -1.419171
H  5.53345 -5.220084 -0.001824
H  -1.990059 3.368566 1.955629
H  -1.345154 3.869811 0.40437
H  7.075791 -3.843513 -1.435376
H  7.402502 -5.563115 -1.616339
H  6.509263 -4.702074 -2.864009
H  -2.309857 7.143225 1.415895
H  -1.456825 5.704874 1.549692
H  -4.665484 7.026308 1.317339
H  -5.310547 5.750158 0.451308
elementType: N C H
totalener: -677.23488367 hartree
nucrepener: 1023.75727445 hartree
electener: -1700.99215812 hartree
oneelecener: -2945.87085407 hartree
twoeener: 1244.87869595 hartree
cpcmener: -0.02353754 hartree
kineticenergy: 673.78562699 hartree
xcener: -69.476380818144 hartree
chargesum: -0.0000000
charge: -0.443715 -0.325706 -0.306033 -0.129606 -0.134198 -0.109914 -0.107561 -0.128967 -0.119605 -0.127739 -0.102943 -0.043083 -0.079514 -0.069532 -0.281068 0.293848 0.070573 0.061236 0.070629 0.061038 0.059394 0.057437 0.059965 0.057379 0.058769 0.057846 0.057031 0.056248 0.055507 0.055584 0.054733 0.054998 0.045239 0.046082 0.053130 0.053830 0.078704 0.060657 0.077355 0.089279 0.076923 0.172042 0.180191 0.167263 0.166275
qa: -0.4437 -0.3257 -0.3060 -0.1296 -0.1342 -0.1099 -0.1076 -0.1290 -0.1196 -0.1277 -0.1029 -0.0431 -0.0795 -0.0695 -0.2811 0.2938 0.0706 0.0612 0.0706 0.0610 0.0594 0.0574 0.0600 0.0574 0.0588 0.0578 0.0570 0.0562 0.0555 0.0556 0.0547 0.0550 0.0452 0.0461 0.0531 0.0538 0.0787 0.0607 0.0774 0.0893 0.0769 0.1720 0.1802 0.1673 0.1663
va: 2.9615 3.1494 3.0783 3.9016 3.9056 3.8662 3.8689 3.9027 3.8927 3.9203 3.8751 3.8250 3.8766 3.9806 3.9486 4.3407 1.0109 1.0092 1.0108 1.0090 1.0105 1.0101 1.0103 1.0101 1.0086 1.0102 1.0096 1.0112 1.0108 1.0103 1.0093 1.0090 1.0268 1.0251 1.0072 1.0070 0.9927 0.9939 1.0007 1.0042 1.0011 1.0121 1.0128 1.0106 1.0256
dispcorr: -0.014449607 hartree
energy: -677.249333277182
dipole: 19.64006 -19.07180 0.56826 -23.81556 25.14537 1.32981 -4.47343 5.09206 0.61863
magnitude: 1.57290 au
magnitude: 3.99800 debye
