program: Orca
programVersion: 5.0.2
elementType: N N N C C C C C C C C C C C C C H H H H H H H H H H H H H H H H H H H H H H H H H H H H H
charge: 0
multiplicity: 1
keywords: wb97x-d3
keywords: def2-TZVPP
keywords: def2/J RIJCOSX
keywords: DEFGRID2
keywords: scfconv7
keywords: smallprint printgap noloewdin
keywords: NOSOSCF
formula: C13H29N3
InChI: InChI=1/C13H29N3/c1-2-3-4-5-6-7-8-9-10-11-12-16-13(14)15/h2-12,14-15H2,1H3
45 atoms
N  -1.429143 3.261598 0.732302
N  -0.342067 5.195647 -0.0841
N  -0.40902 4.734364 2.174132
C  -0.750526 -2.555155 -0.397837
C  -0.066358 -3.799317 0.156608
C  -1.900366 -2.077659 0.481735
C  1.025266 -4.370072 -0.745491
C  -2.661339 -0.873171 -0.066284
C  2.189854 -3.426886 -1.041461
C  -1.837877 0.407477 -0.14643
C  2.951129 -2.981003 0.202163
C  -2.657903 1.614927 -0.582658
C  4.222443 -2.192659 -0.100412
C  -1.867296 2.916025 -0.597378
C  3.97554 -0.867316 -0.807382
C  -0.764764 4.339966 0.901395
H  -1.129947 -2.767597 -1.404533
H  -0.016822 -1.752215 -0.513648
H  -0.82119 -4.575771 0.319502
H  0.344856 -3.576779 1.146725
H  -1.516972 -1.837657 1.480149
H  -2.603799 -2.905364 0.621048
H  0.572717 -4.680469 -1.693021
H  1.418304 -5.283654 -0.286962
H  -3.062435 -1.116287 -1.056913
H  -3.532154 -0.690187 0.571965
H  2.884395 -3.935061 -1.719187
H  1.825928 -2.554516 -1.591653
H  -1.389804 0.60846 0.83125
H  -1.003272 0.276563 -0.843181
H  3.214307 -3.865492 0.792592
H  2.301957 -2.373919 0.842327
H  -3.522476 1.733169 0.079087
H  -3.060703 1.438716 -1.585515
H  4.896295 -2.808868 -0.704564
H  4.750893 -2.001518 0.837987
H  -1.022508 2.79813 -1.294015
H  -2.504985 3.698206 -1.038467
H  3.296722 -0.233096 -0.232411
H  4.905386 -0.31222 -0.942505
H  3.536672 -1.003859 -1.796862
H  -0.150178 6.147518 0.186608
H  -0.806664 5.130082 -0.975186
H  0.464105 5.233813 2.255061
H  -0.489158 3.996022 2.855648
elementType: N C H
totalener: -677.23051236 hartree
nucrepener: 1104.22668849 hartree
electener: -1781.45720085 hartree
oneelecener: -3107.14567871 hartree
twoeener: 1325.68847786 hartree
cpcmener: -0.02276807 hartree
kineticenergy: 673.78221238 hartree
xcener: -69.479816175039 hartree
chargesum: -0.0000000
charge: -0.453886 -0.326641 -0.308062 -0.117644 -0.136301 -0.130988 -0.161773 -0.131612 -0.138787 -0.111230 -0.121396 -0.103847 -0.112120 -0.067702 -0.274869 0.299942 0.062270 0.059853 0.074140 0.067955 0.062848 0.069472 0.071917 0.073145 0.061097 0.070648 0.077458 0.068262 0.052726 0.056182 0.071705 0.063182 0.049071 0.063872 0.053580 0.067495 0.080512 0.081898 0.079049 0.091546 0.080404 0.172011 0.180425 0.167028 0.167164
qa: -0.4539 -0.3266 -0.3081 -0.1176 -0.1363 -0.1310 -0.1618 -0.1316 -0.1388 -0.1112 -0.1214 -0.1038 -0.1121 -0.0677 -0.2749 0.2999 0.0623 0.0599 0.0741 0.0680 0.0628 0.0695 0.0719 0.0731 0.0611 0.0706 0.0775 0.0683 0.0527 0.0562 0.0717 0.0632 0.0491 0.0639 0.0536 0.0675 0.0805 0.0819 0.0790 0.0915 0.0804 0.1720 0.1804 0.1670 0.1672
va: 2.9312 3.1515 3.0817 3.8553 3.8701 3.9031 3.9227 3.8998 3.8553 3.8199 3.8641 3.8864 3.9009 3.9482 3.9264 4.3295 1.0102 1.0011 1.0122 1.0028 1.0084 1.0122 1.0081 1.0084 1.0091 1.0107 1.0103 0.9997 1.0419 1.0114 1.0118 1.0053 1.0286 1.0151 1.0091 1.0068 0.9928 0.9957 1.0012 1.0051 0.9983 1.0123 1.0120 1.0111 1.0251
dispcorr: -0.016336697 hartree
energy: -677.246849055962
dipole: 7.33233 -6.52647 0.80585 -16.18386 17.52529 1.34144 -4.74431 4.35024 -0.39407
magnitude: 1.61374 au
magnitude: 4.10180 debye
