program: Gaussian 09
title: 000064197
version: EM64L-G09RevD.01
frameworkgroup: C1[X(C17H22N2O)]
method: RPBEPBE
basis: SDD
operation: Freq
keyword: #p
keyword: freq=noraman
keyword: PBEPBE/SDD
title: #p freq=noraman PBEPBE/SDD
converged: YES YES NO NO
title: Mulliken charges:
elementType: O N N C C C C C C C C C C C C C C C C C H H H H H H H H H H H H H H H H H H H H H H
charge: -0.266747 -0.389015 -0.001614 0.473474 -0.105470 -0.110563 -0.100235 -0.529009 -0.511538 -0.531258 -0.450267 -0.450577 -0.451155 -0.520319 0.166720 0.251104 -0.293306 -0.429557 -0.190626 -0.323158 0.196238 0.200783 0.198214 0.182444 0.197164 0.217052 0.202403 0.197510 0.209359 0.197920 0.190394 0.192262 0.199524 0.196792 0.197750 0.259023 0.225959 0.304507 0.234472 0.284364 0.233431 0.245551
chargesum: 0.00000
title: Mulliken charges with hydrogens summed into heavy atoms:
elementType: O N N C C C C C C C C C C C C C C C C C
charge: -0.266747 -0.084508 -0.001614 0.473474 0.090768 0.090220 0.097979 -0.149402 -0.092083 -0.124389 -0.061953 -0.058791 -0.056613 -0.035337 0.166720 0.251104 -0.058834 -0.145193 0.042805 -0.077608
polarizability: 2.41780654e+02 -1.04563806e+01 1.79994886e+02 -1.17901009e+01 -8.15868762e+00 1.38978634e+02
1716.lowfreq: -20.3418 -11.2252 -0.0002 0.0004 0.0007 11.1737 22.7890 23.3764 46.8022
frequency: 20.2272 22.7146 45.6363 54.2214 123.0414 149.0745 177.1793 235.9558 246.6418 296.9065 298.0676 318.0974 356.6285 375.3786 388.5930 392.7875 393.8262 412.6323 419.4308 424.9693 458.6543 515.2390 547.2946 602.9271 611.1791 636.7927 639.0963 679.7859 701.7972 708.1347 721.8431 767.8765 784.4816 808.3984 812.3533 821.0411 868.9396 870.5702 871.3354 897.2154 911.2129 931.0158 944.5123 955.3348 957.3427 968.5859 981.5198 983.1034 986.8960 1006.3904 1018.2746 1038.7396 1047.2179 1048.9636 1057.2940 1095.4753 1102.0197 1104.2246 1106.7603 1110.5374 1113.2506 1130.8958 1156.7823 1181.0367 1183.7279 1200.6022 1221.9964 1251.4403 1267.8097 1278.8647 1287.4184 1290.5618 1304.0845 1306.2330 1309.3544 1310.5625 1313.0057 1323.4923 1326.2544 1338.4543 1343.2633 1347.0769 1356.4470 1361.8774 1365.7005 1404.4633 1448.2317 1450.2395 1450.2719 1451.6214 1460.8073 1461.3827 1464.7967 1481.0779 1494.0902 1546.1997 1580.1938 1600.3439 2939.8159 2951.2251 2960.5113 2961.7345 2963.9638 2967.0134 2970.6059 2991.5169 2994.5340 2997.1049 3005.5859 3009.4463 3018.1436 3021.1231 3027.3712 3029.0479 3055.0388 3123.3931 3136.2306 3155.2058 3166.9179 3560.3046
redmass: 4.4472 4.9341 4.2336 6.8707 4.4337 3.9364 4.0507 3.2779 4.7306 2.2971 2.2850 2.5534 2.0087 3.7529 3.7755 4.4514 3.7673 2.5668 1.7425 1.6938 2.6544 3.3965 1.4237 3.0126 6.6399 3.8239 3.8890 5.5068 5.4147 4.8835 1.7307 3.5696 3.1024 2.7853 3.1245 1.8481 1.5749 1.5877 1.5817 2.6986 2.7372 1.3611 2.2053 1.5100 2.0664 2.2622 2.3704 2.3361 1.7371 2.5839 3.5874 2.6621 1.7717 1.7532 1.8128 1.6439 1.0325 1.3279 1.2433 1.0242 1.7020 2.8319 3.0453 1.2313 1.2141 1.2876 1.1626 1.5703 2.1881 1.8110 1.9031 1.8987 2.2334 7.0721 1.7310 1.8422 1.5424 1.3158 1.2657 1.4458 1.4373 1.4495 1.4715 1.6287 1.4844 2.1369 1.1371 1.8119 1.0988 1.0953 1.0910 1.0936 1.0988 1.0960 1.9163 5.4777 5.8077 7.1519 1.0585 1.0603 1.0631 1.0609 1.0618 1.0607 1.0640 1.0839 1.0840 1.1020 1.0842 1.1014 1.1029 1.1027 1.1021 1.1020 1.0974 1.0889 1.0904 1.0925 1.0998 1.0770
irintensity: 2.6271 2.6760 0.6912 3.0509 1.2239 1.8771 1.2550 7.3998 0.1484 3.3117 3.2579 1.1893 0.6994 2.6327 1.8703 0.3947 4.5247 5.5802 0.4087 0.0413 3.3951 28.5640 64.9451 35.4957 8.5603 0.0449 0.3118 1.0691 1.4725 2.8465 55.3533 0.1458 0.9399 3.9526 1.1034 20.8103 0.0235 0.1003 0.1165 8.0327 0.7738 2.2279 0.9522 3.6505 7.4212 11.1119 10.6715 2.6083 1.3050 4.1836 1.9394 0.1354 0.1122 0.1785 2.1894 3.9912 0.1989 3.2402 5.6000 0.5588 9.7705 2.5819 16.6648 7.7959 2.0014 6.0969 13.1992 10.2185 100.7556 23.6429 3.1854 0.0250 13.8669 1.1146 2.5717 20.1852 6.1642 0.0040 1.8879 8.0991 6.4296 6.3426 1.1600 3.9811 2.4593 14.3071 16.1359 26.5714 2.3807 4.2920 12.9346 19.6580 32.9342 2.0235 224.0792 15.1920 25.6778 136.3941 45.6224 33.9331 20.2927 29.5351 19.8763 48.9172 47.2352 143.6062 156.0840 41.8522 43.9058 20.7933 10.2301 39.5304 102.4560 57.5755 7.5054 9.1907 17.8754 4.7133 21.7467 12.1481
temp: 298.150 k
press: 1.00000 atm
elementType: 8 7 7 6 6 6 6 6 6 6 6 6 6 6 6 6 6 6 6 6 1 1 1 1 1 1 1 1 1 1 1 1 1 1 1 1 1 1 1 1 1 1
symmnumber: 1
zpe: 945062.6 jmol-1
zpe.correction: 0.359955 hartree
zpe.thermalcorrener: 0.376373 hartree
zpe.thermalcorrenthalpy: 0.377317 hartree
zpe.thermalcorrgfe: 0.314473 hartree
zpe.sumelectzpe: -844.271081 hartree
zpe.sumelectthermal: -844.254663 hartree
zpe.sumelectthermalent: -844.253719 hartree
zpe.sumelectthermalfe: -844.316564 hartree
dipole: 3.1913 4.1767 -2.7271
dipole: 5.9217
quadrupole: -131.1176 -119.9371 -119.8830
quadrupole: -15.3870 5.5939 2.0994
quadrupole: -7.4717 3.7088 3.7629 -15.3870 5.5939 2.0994
hfenergy: -844.6310365 hartree
pointgroup: C01 [X(C17H22N2O1)]
dipole: 1.2547326 -1.5845645 1.1587638 debye
polarizability: 241.6925312|11.1556691|179.0842961|11.5147404|-10.166579|139.9773458 unknown
InChI: InChI=1S/C17H22N2O/c20-16(15-2-1-3-18-10-15)19-11-17-7-12-4-13(8-17)6-14(5-12)9-17/h1-3,10,12-14,19H,4-9,11H2
charge 0 multiplicity 1
42 atoms
O  -1.691545 2.076869 -0.725681
N  -0.818652 0.640455 0.893287
N  -5.483627 0.198263 -0.441692
C  1.686607 0.529909 0.445485
C  3.135219 -1.560615 0.695684
C  2.747707 -0.5572 -1.602201
C  4.211489 0.653028 0.079805
C  1.888702 -0.801362 1.228546
C  1.504393 0.201677 -1.064207
C  2.964487 1.404087 0.617549
C  2.9327 -1.880144 -0.810688
C  4.395622 -0.670232 0.871225
C  4.009915 0.330901 -1.425999
C  0.476474 1.332056 0.997906
C  -1.812479 1.052163 0.017341
C  -3.069455 0.21869 0.009211
C  -3.106294 -1.164317 0.31932
C  -4.28534 0.844652 -0.376735
C  -4.338482 -1.851004 0.251907
C  -5.496096 -1.132872 -0.125815
H  3.262942 -2.503306 1.264119
H  2.600465 -0.784233 -2.676467
H  5.10769 1.291571 0.208479
H  0.992193 -1.447113 1.115922
H  2.010706 -0.585749 2.311171
H  1.349202 1.139339 -1.633771
H  0.593472 -0.413646 -1.205825
H  3.108095 1.655077 1.689596
H  2.835494 2.361999 0.073052
H  3.808352 -2.436972 -1.200512
H  2.045173 -2.531299 -0.946099
H  4.559795 -0.451134 1.945863
H  5.29294 -1.208703 0.506138
H  4.902472 -0.192939 -1.823329
H  3.895891 1.269906 -2.004048
H  0.367049 2.277614 0.43601
H  0.662948 1.583778 2.062189
H  -1.013194 -0.125126 1.539394
H  -2.190761 -1.71178 0.573986
H  -4.278168 1.90511 -0.648893
H  -4.402298 -2.920778 0.473735
H  -6.470804 -1.629524 -0.191456
