program: Orca
programVersion: 5.0.2
elementType: N N N C C C C C C C C C C C C C H H H H H H H H H H H H H H H H H H H H H H H H H H H H H
charge: 0
multiplicity: 1
keywords: wb97x-d3
keywords: def2-TZVPP
keywords: def2/J RIJCOSX
keywords: DEFGRID2
keywords: scfconv7
keywords: smallprint printgap noloewdin
keywords: NOSOSCF
formula: C13H29N3
InChI: InChI=1/C13H29N3/c1-2-3-4-5-6-7-8-9-10-11-12-16-13(14)15/h2-12,14-15H2,1H3
45 atoms
N  -0.865364 3.286203 0.662674
N  -1.897644 5.223681 -0.21959
N  0.094344 5.360427 0.928767
C  -1.436949 -2.317373 -0.909923
C  -0.250681 -3.220599 -1.236267
C  -1.636507 -2.064075 0.580232
C  1.109909 -2.621246 -0.896375
C  -2.899977 -1.271267 0.908084
C  2.267012 -3.517053 -1.325228
C  -2.960499 0.134268 0.312172
C  3.651856 -2.91475 -1.104366
C  -1.814389 1.041564 0.740451
C  4.015037 -2.676039 0.356913
C  -1.982949 2.472276 0.250593
C  5.436837 -2.161911 0.529016
C  -0.913062 4.546615 0.454312
H  -2.348539 -2.771271 -1.313423
H  -1.314832 -1.3672 -1.440694
H  -0.271899 -3.458404 -2.3049
H  -0.367973 -4.176899 -0.713831
H  -0.764028 -1.552537 0.996226
H  -1.68728 -3.02855 1.096793
H  1.170884 -2.42541 0.177588
H  1.206508 -1.645927 -1.388353
H  -3.773191 -1.837475 0.56733
H  -2.997154 -1.196658 1.996005
H  2.200215 -4.474387 -0.796159
H  2.153206 -3.754186 -2.388127
H  -2.991614 0.077627 -0.780738
H  -3.90988 0.592378 0.609443
H  3.730002 -1.971046 -1.656001
H  4.399416 -3.582199 -1.545914
H  -0.862599 0.652493 0.366301
H  -1.736745 1.046011 1.833093
H  3.894517 -3.610093 0.915502
H  3.319077 -1.962333 0.806225
H  -2.090847 2.452879 -0.844593
H  -2.944643 2.852208 0.632442
H  5.682068 -2.000993 1.580061
H  6.166882 -2.867691 0.126835
H  5.581764 -1.211742 0.010468
H  -2.012278 6.201462 -0.004027
H  -2.77375 4.745252 -0.350559
H  0.313927 6.167081 0.364002
H  0.919615 4.851488 1.203685
elementType: N C H
totalener: -677.23109478 hartree
nucrepener: 1089.51660145 hartree
electener: -1766.74769622 hartree
oneelecener: -3077.61224096 hartree
twoeener: 1310.86454473 hartree
cpcmener: -0.02342656 hartree
kineticenergy: 673.77880867 hartree
xcener: -69.478654310285 hartree
chargesum: -0.0000000
charge: -0.446203 -0.326556 -0.306434 -0.134629 -0.140878 -0.129135 -0.111649 -0.176509 -0.128051 -0.143081 -0.131660 -0.052343 -0.079545 -0.066214 -0.284593 0.291587 0.076160 0.062959 0.070082 0.061211 0.066864 0.076411 0.067030 0.058370 0.073426 0.074270 0.061791 0.068522 0.066195 0.073792 0.059545 0.069739 0.041912 0.051986 0.055824 0.056641 0.082111 0.059615 0.089326 0.077889 0.078260 0.172430 0.179830 0.167177 0.166525
qa: -0.4462 -0.3266 -0.3064 -0.1346 -0.1409 -0.1291 -0.1116 -0.1765 -0.1281 -0.1431 -0.1317 -0.0523 -0.0795 -0.0662 -0.2846 0.2916 0.0762 0.0630 0.0701 0.0612 0.0669 0.0764 0.0670 0.0584 0.0734 0.0743 0.0618 0.0685 0.0662 0.0738 0.0595 0.0697 0.0419 0.0520 0.0558 0.0566 0.0821 0.0596 0.0893 0.0779 0.0783 0.1724 0.1798 0.1672 0.1665
va: 2.9574 3.1499 3.0809 3.8841 3.9084 3.8491 3.8566 3.9327 3.8990 3.8859 3.8947 3.7920 3.8543 3.9767 3.9521 4.3486 1.0109 1.0062 1.0109 1.0093 1.0010 1.0110 1.0043 1.0094 1.0082 1.0068 1.0089 1.0115 1.0044 1.0114 1.0084 1.0096 1.0289 1.0251 1.0061 1.0072 0.9919 0.9955 1.0036 1.0014 1.0004 1.0119 1.0136 1.0110 1.0255
dispcorr: -0.016016347 hartree
energy: -677.247111125568
dipole: 7.19314 -7.79889 -0.60575 -17.97441 19.34006 1.36565 -2.20106 1.64311 -0.55795
magnitude: 1.59476 au
magnitude: 4.05355 debye
