program: Orca
programVersion: 5.0.2
elementType: N N N C C C C C C C C C C C C C H H H H H H H H H H H H H H H H H H H H H H H H H H H H H
charge: 0
multiplicity: 1
keywords: wb97x-d3
keywords: def2-TZVPP
keywords: def2/J RIJCOSX
keywords: DEFGRID2
keywords: scfconv7
keywords: smallprint printgap noloewdin
keywords: NOSOSCF
formula: C13H29N3
InChI: InChI=1/C13H29N3/c1-2-3-4-5-6-7-8-9-10-11-12-16-13(14)15/h2-12,14-15H2,1H3
45 atoms
N  -0.27718 1.87653 -0.073754
N  0.347936 4.155489 -0.147178
N  1.441853 2.579987 -1.427751
C  -1.431951 -2.209672 -1.082241
C  -0.34416 -3.274674 -0.952217
C  -2.355016 -2.115653 0.128245
C  0.66537 -3.03492 0.169873
C  -3.438502 -1.044358 0.001879
C  1.442287 -1.729843 0.038778
C  -2.916239 0.385959 -0.127507
C  2.474676 -1.540617 1.144653
C  -2.166133 0.896031 1.099579
C  3.13958 -0.167133 1.14272
C  -1.369302 2.164604 0.824769
C  3.964591 0.124278 -0.102709
C  0.445609 2.83718 -0.509819
H  -2.036192 -2.429891 -1.968706
H  -0.966949 -1.239483 -1.277122
H  0.196618 -3.34384 -1.90183
H  -0.815156 -4.252236 -0.804536
H  -1.768804 -1.937465 1.033944
H  -2.837787 -3.087205 0.279135
H  1.373208 -3.870351 0.184586
H  0.16138 -3.060008 1.14134
H  -4.061671 -1.273231 -0.868912
H  -4.102972 -1.106986 0.870265
H  1.930697 -1.703643 -0.941102
H  0.7550 -0.878206 0.054648
H  -2.270157 0.464409 -1.005457
H  -3.761146 1.054203 -0.323624
H  3.24087 -2.320427 1.071654
H  1.984816 -1.689379 2.112556
H  -1.471079 0.138582 1.472867
H  -2.876825 1.083695 1.910174
H  3.782606 -0.080353 2.02308
H  2.367614 0.599959 1.256939
H  -2.056053 2.929058 0.425481
H  -1.007385 2.564132 1.783024
H  4.436049 1.10665 -0.043477
H  4.760706 -0.612771 -0.230693
H  3.361013 0.109723 -1.011363
H  0.712556 4.835989 -0.794897
H  -0.512713 4.446496 0.286368
H  2.265655 3.159201 -1.364139
H  1.66765 1.600296 -1.502961
elementType: N C H
totalener: -677.22807835 hartree
nucrepener: 1197.55679389 hartree
electener: -1874.78487224 hartree
oneelecener: -3294.12003809 hartree
twoeener: 1419.33516586 hartree
cpcmener: -0.02117595 hartree
kineticenergy: 673.78104218 hartree
xcener: -69.484314591969 hartree
chargesum: 0.0000000
charge: -0.463077 -0.325310 -0.320223 -0.124462 -0.160701 -0.139247 -0.138726 -0.151225 -0.078704 -0.149564 -0.112437 -0.099968 -0.113045 -0.074584 -0.296930 0.324136 0.079618 0.056670 0.072420 0.072086 0.066796 0.076063 0.073888 0.066875 0.070388 0.070813 0.072279 -0.010045 0.065964 0.078411 0.063876 0.065901 0.055756 0.077967 0.073960 0.047396 0.065920 0.096339 0.095916 0.089890 0.074564 0.171351 0.180930 0.167109 0.184965
qa: -0.4631 -0.3253 -0.3202 -0.1245 -0.1607 -0.1392 -0.1387 -0.1512 -0.0787 -0.1496 -0.1124 -0.1000 -0.1130 -0.0746 -0.2969 0.3241 0.0796 0.0567 0.0724 0.0721 0.0668 0.0761 0.0739 0.0669 0.0704 0.0708 0.0723 -0.0100 0.0660 0.0784 0.0639 0.0659 0.0558 0.0780 0.0740 0.0474 0.0659 0.0963 0.0959 0.0899 0.0746 0.1714 0.1809 0.1671 0.1850
va: 2.8841 3.1697 3.1131 3.8340 3.9265 3.8657 3.8947 3.9316 3.8248 3.8442 3.8644 3.8428 3.8822 3.9503 3.9285 4.2537 1.0103 1.0150 1.0081 1.0099 1.0024 1.0113 1.0110 1.0032 1.0085 1.0070 1.0063 1.0553 1.0258 1.0101 1.0103 1.0112 1.0213 1.0155 1.0109 1.0220 0.9951 0.9960 1.0027 1.0037 0.9985 1.0129 1.0124 1.0114 1.0218
dispcorr: -0.020827408 hartree
energy: -677.248905758655
dipole: 2.19252 -1.67680 0.51572 -9.05963 10.62171 1.56208 1.72828 -1.81461 -0.08633
magnitude: 1.64728 au
magnitude: 4.18705 debye
