program: Orca
programVersion: 5.0.2
elementType: N N N C C C C C C C C C C C C C H H H H H H H H H H H H H H H H H H H H H H H H H H H H H
charge: 0
multiplicity: 1
keywords: wb97x-d3
keywords: def2-TZVPP
keywords: def2/J RIJCOSX
keywords: DEFGRID2
keywords: scfconv7
keywords: smallprint printgap noloewdin
keywords: NOSOSCF
formula: C13H29N3
InChI: InChI=1/C13H29N3/c1-2-3-4-5-6-7-8-9-10-11-12-16-13(14)15/h2-12,14-15H2,1H3
45 atoms
N  -1.072016 2.592553 0.618459
N  -1.41251 4.892311 1.061211
N  -0.307684 3.542672 2.566941
C  -1.146026 -1.829549 0.689994
C  0.034695 -2.795186 0.749885
C  -1.875435 -1.821882 -0.649553
C  1.182975 -2.442061 -0.18943
C  -3.170306 -1.00975 -0.644918
C  2.382919 -3.368527 -0.02676
C  -3.016258 0.453014 -0.234493
C  3.52135 -3.103761 -1.008237
C  -2.107648 1.272501 -1.141866
C  4.209116 -1.754733 -0.831455
C  -1.836846 2.670398 -0.601811
C  5.383084 -1.566643 -1.780375
C  -0.954419 3.632587 1.352003
H  -0.793769 -0.82057 0.93002
H  -1.858921 -2.094265 1.478631
H  -0.314729 -3.81105 0.532251
H  0.415354 -2.822451 1.776441
H  -2.116352 -2.853494 -0.928521
H  -1.209942 -1.453109 -1.434933
H  1.481958 -1.40446 -0.007542
H  0.84409 -2.482179 -1.229839
H  -3.624153 -1.062355 -1.640238
H  -3.882985 -1.488551 0.03506
H  2.763517 -3.295739 0.998383
H  2.047916 -4.403941 -0.148779
H  -4.00795 0.918123 -0.217159
H  -2.646743 0.51022 0.79266
H  3.142136 -3.185935 -2.033398
H  4.270631 -3.895498 -0.902386
H  -2.558873 1.353439 -2.136243
H  -1.146785 0.76852 -1.281291
H  4.557673 -1.66106 0.202406
H  3.492214 -0.943178 -0.98362
H  -1.301801 3.244833 -1.371157
H  -2.805239 3.181391 -0.471896
H  6.14301 -2.337108 -1.632992
H  5.064231 -1.617993 -2.823681
H  5.86604 -0.598971 -1.634571
H  -1.592892 5.502009 1.843618
H  -2.114825 4.967731 0.342927
H  0.220835 4.354753 2.849375
H  0.224002 2.692241 2.669436
elementType: N C H
totalener: -677.23026725 hartree
nucrepener: 1114.57460875 hartree
electener: -1791.80487600 hartree
oneelecener: -3128.07434952 hartree
twoeener: 1336.26947352 hartree
cpcmener: -0.02220799 hartree
kineticenergy: 673.77998523 hartree
xcener: -69.479493713072 hartree
chargesum: 0.0000000
charge: -0.458185 -0.327434 -0.310159 -0.118120 -0.144792 -0.127300 -0.110677 -0.165572 -0.125587 -0.134910 -0.130906 -0.087850 -0.078276 -0.081751 -0.283326 0.305727 0.043149 0.075501 0.061351 0.069163 0.073676 0.065420 0.059499 0.061806 0.070669 0.071404 0.061004 0.069196 0.075360 0.063827 0.058022 0.070030 0.071798 0.051800 0.054746 0.057200 0.098124 0.062746 0.077575 0.077679 0.089058 0.172594 0.180645 0.167769 0.168304
qa: -0.4582 -0.3274 -0.3102 -0.1181 -0.1448 -0.1273 -0.1107 -0.1656 -0.1256 -0.1349 -0.1309 -0.0878 -0.0783 -0.0818 -0.2833 0.3057 0.0431 0.0755 0.0614 0.0692 0.0737 0.0654 0.0595 0.0618 0.0707 0.0714 0.0610 0.0692 0.0754 0.0638 0.0580 0.0700 0.0718 0.0518 0.0547 0.0572 0.0981 0.0627 0.0776 0.0777 0.0891 0.1726 0.1806 0.1678 0.1683
va: 2.9130 3.1565 3.0863 3.8652 3.9128 3.8475 3.8547 3.9356 3.8998 3.8349 3.8953 3.8126 3.8544 3.9781 3.9503 4.3159 1.0328 1.0114 1.0106 1.0096 1.0112 1.0023 1.0088 1.0071 1.0076 1.0073 1.0103 1.0101 1.0114 1.0259 1.0091 1.0095 1.0160 1.0287 1.0067 1.0074 0.9972 0.9967 1.0013 1.0006 1.0037 1.0115 1.0134 1.0105 1.0234
dispcorr: -0.016660071 hartree
energy: -677.246927318357
dipole: 7.91376 -8.07240 -0.15864 -13.70863 15.26789 1.55926 -6.14425 6.55882 0.41458
magnitude: 1.62122 au
magnitude: 4.12080 debye
