program: Orca
programVersion: 5.0.2
elementType: N N N C C C C C C C C C C C C C H H H H H H H H H H H H H H H H H H H H H H H H H H H H H
charge: 0
multiplicity: 1
keywords: wb97x-d3
keywords: def2-TZVPP
keywords: def2/J RIJCOSX
keywords: DEFGRID2
keywords: scfconv7
keywords: smallprint printgap noloewdin
keywords: NOSOSCF
formula: C13H29N3
InChI: InChI=1/C13H29N3/c1-2-3-4-5-6-7-8-9-10-11-12-16-13(14)15/h2-12,14-15H2,1H3
45 atoms
N  -1.543775 2.616513 0.011819
N  -1.341755 4.747828 1.040144
N  0.46636 3.73883 0.035773
C  -1.033516 -1.310256 -1.290391
C  0.062028 -1.984982 -0.474236
C  -2.448432 -1.738782 -0.909071
C  1.463797 -1.594553 -0.923522
C  -2.844582 -1.44321 0.539061
C  2.565538 -2.266022 -0.113687
C  -2.609368 -0.001388 0.981529
C  3.965844 -1.872703 -0.568049
C  -3.376417 1.03967 0.17679
C  5.091169 -2.46688 0.274659
C  -2.901975 2.458137 0.461524
C  5.179099 -3.986255 0.210951
C  -0.87913 3.642284 0.353339
H  -0.875793 -1.537742 -2.349643
H  -0.937495 -0.222827 -1.202024
H  -0.051536 -3.073181 -0.540015
H  -0.05229 -1.734758 0.585391
H  -2.560336 -2.812789 -1.088943
H  -3.155355 -1.25395 -1.587817
H  1.573036 -0.506515 -0.855718
H  1.589017 -1.843455 -1.983102
H  -3.900233 -1.701276 0.671542
H  -2.294277 -2.108956 1.210162
H  2.444395 -2.010554 0.945091
H  2.441791 -3.351514 -0.177349
H  -2.883174 0.094352 2.037549
H  -1.543152 0.233217 0.929269
H  4.048958 -0.781355 -0.550282
H  4.103628 -2.166744 -1.614559
H  -4.447457 0.960628 0.388075
H  -3.256625 0.862249 -0.894671
H  4.968206 -2.151252 1.315323
H  6.042372 -2.04162 -0.056436
H  -3.573034 3.161563 -0.05112
H  -3.01871 2.656515 1.541481
H  6.032079 -4.356811 0.780094
H  4.287989 -4.465713 0.616598
H  5.297104 -4.330618 -0.818283
H  -0.679294 5.181476 1.661405
H  -2.258461 4.663776 1.4442
H  0.747796 4.636002 -0.328588
H  0.755006 2.982378 -0.56362
totalener: -677.20392193 hartree
nucrepener: 1120.18190672 hartree
electener: -1797.38582865 hartree
oneelecener: -3138.60205251 hartree
twoeener: 1341.21622387 hartree
kineticenergy: 673.82781135 hartree
xcener: -69.483208296773 hartree
chargesum: 0.0000000
charge: -0.371822 -0.319433 -0.292612 -0.086903 -0.129975 -0.169617 -0.110110 -0.152079 -0.107652 -0.117184 -0.106749 -0.105226 -0.108076 -0.084170 -0.257156 0.333118 0.066772 0.053604 0.059415 0.054881 0.068048 0.076090 0.053761 0.053508 0.068783 0.073240 0.055452 0.054655 0.065277 0.067986 0.060928 0.056711 0.066117 0.063255 0.051184 0.065841 0.095816 0.043684 0.084413 0.074453 0.074656 0.144412 0.149644 0.132825 0.150233
qa: -0.3718 -0.3194 -0.2926 -0.0869 -0.1300 -0.1696 -0.1101 -0.1521 -0.1077 -0.1172 -0.1067 -0.1052 -0.1081 -0.0842 -0.2572 0.3331 0.0668 0.0536 0.0594 0.0549 0.0680 0.0761 0.0538 0.0535 0.0688 0.0732 0.0555 0.0547 0.0653 0.0680 0.0609 0.0567 0.0661 0.0633 0.0512 0.0658 0.0958 0.0437 0.0844 0.0745 0.0747 0.1444 0.1496 0.1328 0.1502
va: 2.9596 3.1556 3.0864 3.8359 3.8738 3.9114 3.9052 3.9104 3.8775 3.8580 3.8888 3.8695 3.9055 3.9896 3.9337 4.2202 1.0123 1.0363 1.0131 1.0094 1.0104 1.0040 1.0146 1.0122 1.0093 1.0027 1.0098 1.0106 1.0104 1.0259 1.0132 1.0101 1.0162 1.0274 1.0097 1.0079 0.9908 0.9989 1.0066 1.0017 1.0026 1.0327 1.0390 1.0321 1.0395
dispcorr: -0.017134998 hartree
energy: -677.221056926376
dipole: 8.06104 -7.95177 0.10927 -15.89899 16.93145 1.03245 -0.41406 0.79824 0.38419
magnitude: 1.10702 au
magnitude: 2.81383 debye
