program: Orca
programVersion: 5.0.2
elementType: N N N C C C C C C C C C C C C C H H H H H H H H H H H H H H H H H H H H H H H H H H H H H
charge: 0
multiplicity: 1
keywords: wb97x-d3
keywords: def2-TZVPP
keywords: def2/J RIJCOSX
keywords: DEFGRID2
keywords: scfconv7
keywords: smallprint printgap noloewdin
keywords: NOSOSCF
formula: C13H29N3
InChI: InChI=1/C13H29N3/c1-2-3-4-5-6-7-8-9-10-11-12-16-13(14)15/h2-12,14-15H2,1H3
45 atoms
N  -0.743618 1.97932 -0.049339
N  -1.078425 3.791557 1.462107
N  0.721617 2.379734 1.675733
C  -1.431878 -2.304398 0.281395
C  -0.059567 -1.744523 -0.075574
C  -2.500585 -2.076686 -0.788037
C  0.980338 -2.01522 1.006548
C  -2.697436 -0.616862 -1.194025
C  2.34224 -1.380665 0.738102
C  -3.121357 0.287512 -0.043063
C  3.089029 -1.964255 -0.455028
C  -3.187094 1.76887 -0.401388
C  4.45619 -1.327129 -0.671283
C  -1.851953 2.349629 -0.884214
C  5.206464 -1.916752 -1.856762
C  -0.419207 2.686174 0.954619
H  -1.758221 -1.869798 1.231176
H  -1.347577 -3.380023 0.466463
H  -0.126812 -0.663278 -0.231049
H  0.264665 -2.175121 -1.028637
H  -3.450678 -2.487198 -0.431282
H  -2.239396 -2.655565 -1.679364
H  1.10381 -3.094981 1.145814
H  0.596225 -1.63497 1.959156
H  -1.771141 -0.242985 -1.636363
H  -3.449047 -0.566807 -1.988568
H  2.213444 -0.302957 0.581077
H  2.96882 -1.483757 1.629927
H  -4.100059 -0.034268 0.327119
H  -2.42864 0.170904 0.792455
H  2.492708 -1.845345 -1.364382
H  3.208957 -3.043943 -0.311339
H  -3.529385 2.322316 0.478895
H  -3.938643 1.93855 -1.179224
H  5.057604 -1.441114 0.235886
H  4.332745 -0.249625 -0.816421
H  -1.647501 1.976523 -1.890566
H  -1.9693 3.439515 -1.007142
H  5.382349 -2.98527 -1.722045
H  4.642432 -1.792592 -2.782623
H  6.176411 -1.439083 -1.997039
H  -0.478808 4.51414 1.824965
H  -1.822449 4.158361 0.893635
H  0.617397 2.423242 2.677051
H  1.134011 1.512348 1.371936
totalener: -677.20220424 hartree
nucrepener: 1169.02140483 hartree
electener: -1846.22360908 hartree
oneelecener: -3236.18507402 hartree
twoeener: 1389.96146494 hartree
kineticenergy: 673.82942523 hartree
xcener: -69.486574494231 hartree
chargesum: 0.0000000
charge: -0.385742 -0.318662 -0.319334 -0.119158 -0.116043 -0.161424 -0.136386 -0.131997 -0.130179 -0.087834 -0.103703 -0.151989 -0.086814 -0.059636 -0.254213 0.348862 0.060715 0.069695 0.052860 0.064326 0.067236 0.068863 0.063444 0.064549 0.071070 0.070993 0.048239 0.071660 0.071841 0.061678 0.058140 0.053558 0.063867 0.066425 0.049363 0.055108 0.087507 0.046354 0.071362 0.072377 0.083179 0.142458 0.150733 0.134486 0.172166
qa: -0.3857 -0.3187 -0.3193 -0.1192 -0.1160 -0.1614 -0.1364 -0.1320 -0.1302 -0.0878 -0.1037 -0.1520 -0.0868 -0.0596 -0.2542 0.3489 0.0607 0.0697 0.0529 0.0643 0.0672 0.0689 0.0634 0.0645 0.0711 0.0710 0.0482 0.0717 0.0718 0.0617 0.0581 0.0536 0.0639 0.0664 0.0494 0.0551 0.0875 0.0464 0.0714 0.0724 0.0832 0.1425 0.1507 0.1345 0.1722
va: 2.9347 3.1373 3.0930 3.8747 3.8231 3.9387 3.8978 3.8716 3.9168 3.8303 3.8753 3.9152 3.8961 3.9417 3.9519 4.2020 1.0057 1.0117 1.0435 1.0132 1.0099 1.0089 1.0138 1.0113 1.0037 1.0095 1.0177 1.0102 1.0103 1.0216 1.0108 1.0106 1.0100 1.0182 1.0088 1.0066 0.9956 1.0092 1.0033 1.0039 1.0061 1.0342 1.0378 1.0307 1.0425
dispcorr: -0.019353899 hartree
energy: -677.221558141019
dipole: 5.69592 -5.81279 -0.11687 -10.69122 11.50809 0.81687 -3.92761 4.51251 0.58490
magnitude: 1.01146 au
magnitude: 2.57093 debye
