program: Orca
programVersion: 5.0.2
elementType: N N N C C C C C C C C C C C C C H H H H H H H H H H H H H H H H H H H H H H H H H H H H H
charge: 0
multiplicity: 1
keywords: wb97x-d3
keywords: def2-TZVPP
keywords: def2/J RIJCOSX
keywords: DEFGRID2
keywords: scfconv7
keywords: smallprint printgap noloewdin
keywords: NOSOSCF
formula: C13H29N3
InChI: InChI=1/C13H29N3/c1-2-3-4-5-6-7-8-9-10-11-12-16-13(14)15/h2-12,14-15H2,1H3
45 atoms
N  -2.214346 3.512135 1.268362
N  -3.479703 5.281301 0.306205
N  -1.217283 5.494979 0.663889
C  0.776676 -0.49188 -0.831514
C  1.612063 -0.97331 -2.016283
C  -0.546109 -1.231455 -0.665366
C  2.01621 -2.445459 -1.984364
C  -1.410452 -0.713688 0.482305
C  2.841822 -2.841734 -0.766682
C  -1.919749 0.710652 0.294723
C  3.332429 -4.28255 -0.824579
C  -2.838181 1.166961 1.419168
C  4.176951 -4.684368 0.377956
C  -3.324138 2.599953 1.245289
C  4.66162 -6.125069 0.309362
C  -2.329477 4.675833 0.775402
H  0.586786 0.576343 -0.963782
H  1.354222 -0.574612 0.094992
H  2.51726 -0.361013 -2.079889
H  1.056929 -0.78154 -2.940084
H  -0.349954 -2.295216 -0.500203
H  -1.113665 -1.173627 -1.601467
H  2.591607 -2.664973 -2.889377
H  1.127537 -3.081758 -2.042476
H  -2.266765 -1.384364 0.607516
H  -0.844268 -0.776027 1.418436
H  3.701521 -2.168032 -0.676272
H  2.254276 -2.701135 0.146497
H  -1.08457 1.411091 0.226761
H  -2.454066 0.778573 -0.660929
H  3.914919 -4.430889 -1.740661
H  2.472337 -4.95641 -0.905951
H  -2.3140 1.090149 2.376022
H  -3.706346 0.502949 1.484351
H  3.597816 -4.536632 1.294403
H  5.036923 -4.012177 0.455715
H  -3.905863 2.648583 0.307077
H  -4.033378 2.829371 2.05228
H  5.268687 -6.38666 1.176352
H  3.82401 -6.823478 0.271592
H  5.269199 -6.296105 -0.580946
H  -4.28456 4.6858 0.214155
H  -3.355392 5.891859 -0.484413
H  -0.414628 5.083889 1.113037
H  -1.365223 6.449537 0.953818
totalener: -677.20463686 hartree
nucrepener: 1073.51580547 hartree
electener: -1750.72044233 hartree
oneelecener: -3045.17759170 hartree
twoeener: 1294.45714937 hartree
kineticenergy: 673.82689968 hartree
xcener: -69.480591049530 hartree
chargesum: 0.0000000
charge: -0.371911 -0.321556 -0.292757 -0.127785 -0.166379 -0.130674 -0.123518 -0.130689 -0.113603 -0.103846 -0.107184 -0.086809 -0.074248 -0.083802 -0.258702 0.332598 0.077889 0.065740 0.070534 0.070851 0.069890 0.061225 0.070714 0.065152 0.064605 0.059021 0.059693 0.054243 0.071194 0.043241 0.051014 0.053497 0.058601 0.054024 0.051712 0.051164 0.038941 0.095624 0.083834 0.072006 0.071534 0.149487 0.143934 0.148349 0.133153
qa: -0.3719 -0.3216 -0.2928 -0.1278 -0.1664 -0.1307 -0.1235 -0.1307 -0.1136 -0.1038 -0.1072 -0.0868 -0.0742 -0.0838 -0.2587 0.3326 0.0779 0.0657 0.0705 0.0709 0.0699 0.0612 0.0707 0.0652 0.0646 0.0590 0.0597 0.0542 0.0712 0.0432 0.0510 0.0535 0.0586 0.0540 0.0517 0.0512 0.0389 0.0956 0.0838 0.0720 0.0715 0.1495 0.1439 0.1483 0.1332
va: 2.9672 3.1546 3.0845 3.8591 3.9272 3.8862 3.8726 3.9148 3.8674 3.8537 3.8896 3.8885 3.8837 3.9961 3.9534 4.2238 1.0164 1.0041 1.0082 1.0093 1.0099 1.0111 1.0126 1.0045 1.0101 1.0111 1.0125 1.0104 1.0376 1.0115 1.0118 1.0106 1.0263 1.0173 1.0081 1.0083 1.0006 0.9936 1.0061 1.0033 1.0031 1.0402 1.0322 1.0426 1.0319
dispcorr: -0.015880972 hartree
energy: -677.220517830717
dipole: 12.10855 -12.59003 -0.48148 -22.01138 22.87699 0.86561 -3.76658 3.44513 -0.32145
magnitude: 1.04136 au
magnitude: 2.64694 debye
