program: Orca
programVersion: 5.0.2
elementType: N N N C C C C C C C C C C C C C H H H H H H H H H H H H H H H H H H H H H H H H H H H H H
charge: 0
multiplicity: 1
keywords: wb97x-d3
keywords: def2-TZVPP
keywords: def2/J RIJCOSX
keywords: DEFGRID2
keywords: scfconv7
keywords: smallprint printgap noloewdin
keywords: NOSOSCF
formula: C13H29N3
InChI: InChI=1/C13H29N3/c1-2-3-4-5-6-7-8-9-10-11-12-16-13(14)15/h2-12,14-15H2,1H3
45 atoms
N  -0.758964 1.686042 -0.655873
N  -0.308245 3.749997 0.446783
N  1.120804 1.957503 0.634073
C  -1.453332 -2.302617 0.613146
C  -0.394072 -1.972506 -0.431642
C  -2.890288 -2.143491 0.112245
C  1.030922 -2.094702 0.092478
C  -3.221895 -0.760183 -0.448923
C  2.070403 -1.795321 -0.983544
C  -3.056445 0.366437 0.565034
C  3.517426 -1.836614 -0.501475
C  -3.155563 1.76978 -0.025785
C  3.900228 -0.690943 0.428783
C  -2.077512 2.079406 -1.074017
C  5.356315 -0.749525 0.867514
C  -0.055872 2.438155 0.087802
H  -1.294525 -1.674085 1.494667
H  -1.315847 -3.331843 0.959907
H  -0.534394 -0.949581 -0.790902
H  -0.523121 -2.629169 -1.299939
H  -3.579402 -2.379552 0.929444
H  -3.07963 -2.890598 -0.664959
H  1.204329 -3.099919 0.492786
H  1.151422 -1.411445 0.94032
H  -2.592063 -0.571985 -1.321212
H  -4.251155 -0.763478 -0.821693
H  1.944594 -2.51569 -1.797294
H  1.861464 -0.814342 -1.427147
H  -3.81123 0.255436 1.34993
H  -2.089005 0.276911 1.061787
H  4.184672 -1.817635 -1.368888
H  3.70767 -2.791312 0.00103
H  -3.085898 2.493672 0.793203
H  -4.139032 1.923104 -0.482041
H  3.257055 -0.690706 1.313107
H  3.716087 0.259542 -0.084352
H  -2.306124 1.531202 -1.990725
H  -2.158845 3.139809 -1.361114
H  5.61161 0.077586 1.530368
H  5.569427 -1.676448 1.402208
H  6.029789 -0.705257 0.010106
H  -0.002458 4.010209 1.36916
H  -1.228019 4.094791 0.235542
H  1.898991 2.59766 0.611689
H  1.362974 1.051122 0.266167
totalener: -677.20090718 hartree
nucrepener: 1186.75818490 hartree
electener: -1863.95909207 hartree
oneelecener: -3271.59752080 hartree
twoeener: 1407.63842872 hartree
kineticenergy: 673.82306307 hartree
xcener: -69.486847832487 hartree
chargesum: -0.0000000
charge: -0.390682 -0.319308 -0.304356 -0.111053 -0.118086 -0.161160 -0.154554 -0.135298 -0.114617 -0.095501 -0.110952 -0.148708 -0.097250 -0.068319 -0.261805 0.354673 0.061207 0.068570 0.060683 0.064195 0.067122 0.069171 0.068550 0.052516 0.070473 0.071083 0.073705 0.060700 0.073262 0.064994 0.069173 0.053517 0.058023 0.066808 0.064394 0.033097 0.086416 0.059421 0.082233 0.075745 0.074222 0.143109 0.149804 0.134214 0.160569
qa: -0.3907 -0.3193 -0.3044 -0.1111 -0.1181 -0.1612 -0.1546 -0.1353 -0.1146 -0.0955 -0.1110 -0.1487 -0.0972 -0.0683 -0.2618 0.3547 0.0612 0.0686 0.0607 0.0642 0.0671 0.0692 0.0686 0.0525 0.0705 0.0711 0.0737 0.0607 0.0733 0.0650 0.0692 0.0535 0.0580 0.0668 0.0644 0.0331 0.0864 0.0594 0.0822 0.0757 0.0742 0.1431 0.1498 0.1342 0.1606
va: 2.9156 3.1602 3.0886 3.8735 3.8307 3.9393 3.8669 3.8800 3.8729 3.8395 3.8747 3.9058 3.8680 3.9521 3.9738 4.1828 1.0048 1.0125 1.0418 1.0154 1.0095 1.0084 1.0169 1.0113 1.0045 1.0095 1.0132 1.0165 1.0094 1.0211 1.0099 1.0107 1.0120 1.0186 1.0043 1.0112 0.9967 1.0006 1.0053 1.0034 1.0031 1.0337 1.0407 1.0336 1.0458
dispcorr: -0.020644772 hartree
energy: -677.221551950154
dipole: 5.03217 -4.85755 0.17462 -8.65583 9.52030 0.86447 1.39849 -0.96612 0.43237
magnitude: 0.98221 au
magnitude: 2.49659 debye
