program: Orca
programVersion: 5.0.2
elementType: N N N C C C C C C C C C C C C C H H H H H H H H H H H H H H H H H H H H H H H H H H H H H
charge: 0
multiplicity: 1
keywords: wb97x-d3
keywords: def2-TZVPP
keywords: def2/J RIJCOSX
keywords: DEFGRID2
keywords: scfconv7
keywords: smallprint printgap noloewdin
keywords: NOSOSCF
formula: C13H29N3
InChI: InChI=1/C13H29N3/c1-2-3-4-5-6-7-8-9-10-11-12-16-13(14)15/h2-12,14-15H2,1H3
45 atoms
N  -1.77563 2.693253 0.886835
N  -2.146192 4.933592 1.578001
N  -0.312279 3.750799 2.313874
C  -0.501704 -1.183782 -0.18434
C  0.869127 -1.566368 -0.727321
C  -1.61299 -1.357475 -1.213357
C  1.988708 -1.376015 0.289135
C  -3.018716 -1.119632 -0.662889
C  3.379568 -1.72658 -0.232288
C  -3.209059 0.21942 0.044343
C  3.563506 -3.199017 -0.580761
C  -2.937385 1.437066 -0.829369
C  4.98512 -3.542795 -1.006082
C  -2.887416 2.729777 -0.026411
C  5.15732 -5.013186 -1.358094
C  -1.459923 3.735913 1.537344
H  -0.477304 -0.147126 0.16748
H  -0.724186 -1.796071 0.69756
H  1.087425 -0.967987 -1.619204
H  0.839959 -2.607266 -1.064089
H  -1.567829 -2.371057 -1.624708
H  -1.423973 -0.690738 -2.060388
H  1.775282 -1.976261 1.180644
H  1.986231 -0.333701 0.623039
H  -3.740034 -1.210356 -1.481551
H  -3.262131 -1.922209 0.040502
H  3.602946 -1.113598 -1.112462
H  4.122169 -1.447407 0.522073
H  -4.234986 0.276468 0.422996
H  -2.564652 0.269872 0.924625
H  2.875424 -3.484322 -1.382297
H  3.286263 -3.812177 0.284474
H  -3.703894 1.517125 -1.60673
H  -1.980378 1.33257 -1.346791
H  5.679497 -3.274088 -0.204112
H  5.26582 -2.925559 -1.865024
H  -2.822153 3.575318 -0.7309
H  -3.843904 2.850252 0.505583
H  6.180296 -5.237883 -1.661072
H  4.917539 -5.654373 -0.508119
H  4.500253 -5.302615 -2.179944
H  -1.577705 5.758471 1.672754
H  -2.882223 5.043773 0.902253
H  -0.426466 4.164176 3.226255
H  0.103983 2.834942 2.365309
totalener: -677.20474810 hartree
nucrepener: 1098.08951578 hartree
electener: -1775.29426388 hartree
oneelecener: -3094.44026406 hartree
twoeener: 1319.14600018 hartree
kineticenergy: 673.83256043 hartree
xcener: -69.482761918022 hartree
chargesum: 0.0000000
charge: -0.370451 -0.318320 -0.293528 -0.115597 -0.108419 -0.118536 -0.113003 -0.163401 -0.126468 -0.114729 -0.102651 -0.113335 -0.086134 -0.069231 -0.252187 0.328137 0.049359 0.057371 0.055213 0.055620 0.066719 0.061774 0.054628 0.068674 0.066523 0.067048 0.057059 0.064407 0.065810 0.076188 0.053450 0.052591 0.065724 0.058328 0.050867 0.051700 0.058918 0.078434 0.083202 0.071359 0.070996 0.144355 0.149364 0.132137 0.150038
qa: -0.3705 -0.3183 -0.2935 -0.1156 -0.1084 -0.1185 -0.1130 -0.1634 -0.1265 -0.1147 -0.1027 -0.1133 -0.0861 -0.0692 -0.2522 0.3281 0.0494 0.0574 0.0552 0.0556 0.0667 0.0618 0.0546 0.0687 0.0665 0.0670 0.0571 0.0644 0.0658 0.0762 0.0535 0.0526 0.0657 0.0583 0.0509 0.0517 0.0589 0.0784 0.0832 0.0714 0.0710 0.1444 0.1494 0.1321 0.1500
va: 2.9690 3.1518 3.0862 3.8706 3.8762 3.8699 3.9063 3.9399 3.9061 3.8424 3.8694 3.9021 3.8968 3.9684 3.9504 4.2274 1.0355 1.0110 1.0106 1.0126 1.0134 1.0051 1.0109 1.0138 1.0085 1.0080 1.0110 1.0127 1.0092 1.0295 1.0103 1.0097 1.0165 1.0247 1.0090 1.0074 0.9973 0.9883 1.0063 1.0033 1.0040 1.0330 1.0383 1.0321 1.0404
dispcorr: -0.016354978 hartree
energy: -677.221103081801
dipole: 9.85583 -9.99165 -0.13582 -17.06276 18.12985 1.06709 -6.51960 6.91329 0.39369
magnitude: 1.14547 au
magnitude: 2.91156 debye
