program: Orca
programVersion: 5.0.2
elementType: N N N C C C C C C C C C C C C C H H H H H H H H H H H H H H H H H H H H H H H H H H H H H
charge: 0
multiplicity: 1
keywords: wb97x-d3
keywords: def2-TZVPP
keywords: def2/J RIJCOSX
keywords: DEFGRID2
keywords: scfconv7
keywords: smallprint printgap noloewdin
keywords: NOSOSCF
formula: C13H29N3
InChI: InChI=1/C13H29N3/c1-2-3-4-5-6-7-8-9-10-11-12-16-13(14)15/h2-12,14-15H2,1H3
45 atoms
N  -2.917527 3.334636 1.171367
N  -2.128446 5.569093 1.001881
N  -2.669847 4.654057 3.042264
C  0.463461 -1.143127 -0.55357
C  1.081538 -2.420037 0.000332
C  -0.945683 -0.886518 -0.035958
C  2.488161 -2.688629 -0.51833
C  -1.562663 0.398921 -0.571833
C  3.09967 -3.958088 0.063698
C  -2.977399 0.635022 -0.05746
C  4.542686 -4.215474 -0.359086
C  -3.65411 1.874528 -0.631946
C  4.725521 -4.501028 -1.845351
C  -2.972945 3.186398 -0.25803
C  6.171438 -4.811399 -2.205086
C  -2.587371 4.451879 1.673555
H  0.445856 -1.19158 -1.647847
H  1.103764 -0.290639 -0.302035
H  0.437166 -3.27141 -0.243805
H  1.102903 -2.365981 1.094089
H  -0.929416 -0.848423 1.058656
H  -1.586994 -1.735764 -0.296424
H  3.132228 -1.834794 -0.279642
H  2.46047 -2.748183 -1.610666
H  -0.920191 1.240622 -0.29544
H  -1.569377 0.368773 -1.667707
H  3.057724 -3.8981 1.155896
H  2.480774 -4.819338 -0.211732
H  -3.590244 -0.240431 -0.293662
H  -2.960501 0.716471 1.031573
H  4.93284 -5.064549 0.211195
H  5.16125 -3.356299 -0.076422
H  -4.688594 1.912616 -0.281399
H  -3.697525 1.800336 -1.723675
H  4.382614 -3.648613 -2.4375
H  4.087296 -5.343233 -2.131275
H  -1.967513 3.206525 -0.702604
H  -3.530043 4.003747 -0.745433
H  6.537426 -5.680006 -1.654769
H  6.28626 -5.023254 -3.26839
H  6.826943 -3.972753 -1.963818
H  -2.403424 6.453893 1.394743
H  -2.210356 5.545511 -0.000063
H  -1.871112 5.116946 3.447337
H  -2.894116 3.799118 3.525483
totalener: -677.20596280 hartree
nucrepener: 1052.07958716 hartree
electener: -1729.28554997 hartree
oneelecener: -3002.28536452 hartree
twoeener: 1272.99981455 hartree
kineticenergy: 673.83476389 hartree
xcener: -69.480597977475 hartree
chargesum: 0.0000000
charge: -0.365101 -0.319650 -0.292412 -0.091747 -0.116434 -0.120804 -0.107600 -0.124918 -0.110369 -0.085351 -0.131512 -0.129097 -0.079300 -0.083243 -0.260996 0.319660 0.051267 0.051562 0.054182 0.053119 0.057443 0.052431 0.054039 0.055086 0.059946 0.050060 0.066008 0.057145 0.063043 0.066213 0.066867 0.054648 0.066437 0.054867 0.054669 0.053541 0.089280 0.063795 0.072194 0.083202 0.072779 0.144127 0.149907 0.131994 0.149025
qa: -0.3651 -0.3196 -0.2924 -0.0917 -0.1164 -0.1208 -0.1076 -0.1249 -0.1104 -0.0854 -0.1315 -0.1291 -0.0793 -0.0832 -0.2610 0.3197 0.0513 0.0516 0.0542 0.0531 0.0574 0.0524 0.0540 0.0551 0.0599 0.0501 0.0660 0.0571 0.0630 0.0662 0.0669 0.0546 0.0664 0.0549 0.0547 0.0535 0.0893 0.0638 0.0722 0.0832 0.0728 0.1441 0.1499 0.1320 0.1490
va: 2.9664 3.1468 3.0781 3.8784 3.9072 3.9161 3.8795 3.9107 3.8998 3.8493 3.9048 3.9495 3.8662 3.9175 3.9558 4.2489 1.0128 1.0132 1.0110 1.0132 1.0113 1.0129 1.0106 1.0112 1.0045 1.0088 1.0124 1.0113 1.0101 1.0409 1.0111 1.0101 1.0209 1.0145 1.0092 1.0074 0.9797 1.0002 1.0037 1.0057 1.0028 1.0328 1.0384 1.0323 1.0420
dispcorr: -0.015189875 hartree
energy: -677.221152679333
dipole: 15.97742 -15.74118 0.23624 -19.72319 20.71145 0.98826 -8.38572 8.45026 0.06454
magnitude: 1.01815 au
magnitude: 2.58793 debye
