program: Orca
programVersion: 5.0.2
elementType: N N N C C C C C C C C C C C C C H H H H H H H H H H H H H H H H H H H H H H H H H H H H H
charge: 0
multiplicity: 1
keywords: wb97x-d3
keywords: def2-TZVPP
keywords: def2/J RIJCOSX
keywords: DEFGRID2
keywords: scfconv7
keywords: smallprint printgap noloewdin
keywords: NOSOSCF
formula: C13H29N3
InChI: InChI=1/C13H29N3/c1-2-3-4-5-6-7-8-9-10-11-12-16-13(14)15/h2-12,14-15H2,1H3
45 atoms
N  0.075225 1.98616 0.424471
N  -1.065854 3.274839 -1.232251
N  1.075771 2.528056 -1.571039
C  -1.205565 -1.673278 -0.976119
C  -0.21271 -2.817718 -1.163394
C  -2.20093 -1.895227 0.157477
C  0.667628 -3.111492 0.052042
C  -3.26312 -0.800605 0.275216
C  1.455602 -1.920158 0.595933
C  -2.703546 0.618414 0.35964
C  2.408301 -1.286929 -0.411367
C  -1.785769 0.861302 1.552986
C  3.223619 -0.127598 0.159214
C  -0.940932 2.128207 1.429348
C  4.213145 -0.531367 1.243552
C  -0.001676 2.56545 -0.703707
H  -1.756629 -1.528284 -1.911679
H  -0.65579 -0.741726 -0.809417
H  0.420593 -2.596046 -2.027267
H  -0.758112 -3.729905 -1.426029
H  -1.664984 -1.988502 1.106028
H  -2.704493 -2.856562 0.012257
H  1.369195 -3.908648 -0.213941
H  0.052181 -3.521933 0.857481
H  -3.931287 -0.858074 -0.589767
H  -3.886913 -1.003997 1.151206
H  0.775394 -1.145267 0.963647
H  2.017611 -2.259903 1.470225
H  -2.172271 0.841401 -0.56828
H  -3.538924 1.325759 0.400125
H  1.833039 -0.917003 -1.265834
H  3.08407 -2.051946 -0.81145
H  -1.094472 0.02496 1.680128
H  -2.380013 0.909697 2.470676
H  2.53411 0.626236 0.552038
H  3.777835 0.3478 -0.65699
H  -1.60908 2.99578 1.291205
H  -0.441655 2.301851 2.386708
H  4.89309 -1.30932 0.890724
H  4.82059 0.317832 1.557326
H  3.711175 -0.911969 2.133154
H  -0.811869 4.092593 -1.761732
H  -1.837084 3.439992 -0.608916
H  0.84118 2.343451 -2.533459
H  1.813117 1.930943 -1.231878
totalener: -677.20038151 hartree
nucrepener: 1223.07059524 hartree
electener: -1900.27097676 hartree
oneelecener: -3344.23987067 hartree
twoeener: 1443.96889391 hartree
kineticenergy: 673.81830417 hartree
xcener: -69.489285171373 hartree
chargesum: 0.0000000
charge: -0.384592 -0.315505 -0.325504 -0.066674 -0.171517 -0.149715 -0.155393 -0.156100 -0.103152 -0.156877 -0.106522 -0.108075 -0.134016 -0.052592 -0.269842 0.347146 0.075708 0.019753 0.074359 0.070726 0.067532 0.071527 0.071303 0.075848 0.069777 0.068522 0.052447 0.077541 0.075562 0.073615 0.050458 0.068393 0.077513 0.076705 0.056462 0.062365 0.037754 0.088599 0.074388 0.084673 0.076213 0.141417 0.154297 0.135433 0.180043
qa: -0.3846 -0.3155 -0.3255 -0.0667 -0.1715 -0.1497 -0.1554 -0.1561 -0.1032 -0.1569 -0.1065 -0.1081 -0.1340 -0.0526 -0.2698 0.3471 0.0757 0.0198 0.0744 0.0707 0.0675 0.0715 0.0713 0.0758 0.0698 0.0685 0.0524 0.0775 0.0756 0.0736 0.0505 0.0684 0.0775 0.0767 0.0565 0.0624 0.0378 0.0886 0.0744 0.0847 0.0762 0.1414 0.1543 0.1354 0.1800
va: 2.9177 3.1276 3.1188 3.8284 3.9256 3.8768 3.8972 3.9511 3.8432 3.8895 3.8213 3.7984 3.8736 3.9658 3.9644 4.1569 1.0122 1.0237 1.0023 1.0111 1.0007 1.0141 1.0103 1.0041 1.0079 1.0096 1.0213 1.0120 1.0055 1.0082 1.0196 1.0137 1.0098 1.0171 1.0437 0.9995 1.0129 1.0047 1.0020 1.0061 1.0014 1.0359 1.0370 1.0310 1.0389
dispcorr: -0.022468294 hartree
energy: -677.222849808382
dipole: 2.56208 -3.02236 -0.46028 -9.56466 10.17324 0.60858 2.32814 -2.89240 -0.56426
magnitude: 0.94901 au
magnitude: 2.41218 debye
