program: Orca
programVersion: 5.0.2
elementType: N N N C C C C C C C C C C C C C H H H H H H H H H H H H H H H H H H H H H H H H H H H H H
charge: 0
multiplicity: 1
keywords: wb97x-d3
keywords: def2-TZVPP
keywords: def2/J RIJCOSX
keywords: DEFGRID2
keywords: scfconv7
keywords: smallprint printgap noloewdin
keywords: NOSOSCF
formula: C13H29N3
InChI: InChI=1/C13H29N3/c1-2-3-4-5-6-7-8-9-10-11-12-16-13(14)15/h2-12,14-15H2,1H3
45 atoms
N  -2.64828 4.019956 1.180751
N  -3.816263 5.838125 0.191004
N  -1.745619 6.137282 1.148418
C  0.388632 -1.83105 -0.239675
C  1.594062 -2.183375 -1.101681
C  -0.150825 -0.429637 -0.496731
C  2.151876 -3.573693 -0.823366
C  -1.369614 -0.087976 0.350905
C  3.355025 -3.916741 -1.693001
C  -1.893727 1.323059 0.116876
C  3.890045 -5.333631 -1.498612
C  -3.125552 1.644932 0.950666
C  4.371649 -5.660857 -0.086356
C  -3.633762 3.065851 0.749163
C  5.484001 -4.747569 0.411472
C  -2.758093 5.239383 0.848376
H  0.658487 -1.925965 0.817733
H  -0.406918 -2.564142 -0.412022
H  2.382842 -1.439643 -0.94418
H  1.31856 -2.107264 -2.159167
H  -0.406025 -0.327142 -1.557101
H  0.640212 0.303785 -0.3074
H  1.365242 -4.320332 -0.980271
H  2.422548 -3.641592 0.235292
H  -2.165379 -0.813222 0.14736
H  -1.119271 -0.20892 1.410451
H  3.078759 -3.792155 -2.744679
H  4.151676 -3.188215 -1.512038
H  -1.111739 2.052086 0.34389
H  -2.131294 1.450541 -0.945807
H  4.716023 -5.496613 -2.198207
H  3.111852 -6.049391 -1.781797
H  -2.898284 1.503555 2.011124
H  -3.929913 0.943202 0.707361
H  4.724236 -6.695552 -0.072864
H  3.53179 -5.62809 0.613114
H  -3.90558 3.18237 -0.315007
H  -4.568865 3.183229 1.314591
H  6.328045 -4.739449 -0.280862
H  5.145184 -3.717157 0.526211
H  5.858816 -5.073683 1.381906
H  -3.568945 6.588835 -0.432021
H  -4.497886 5.213453 -0.203515
H  -2.063065 7.017714 1.522405
H  -1.041303 5.713256 1.73014
totalener: -677.20623321 hartree
nucrepener: 1042.50713427 hartree
electener: -1719.71336747 hartree
oneelecener: -2983.12916241 hartree
twoeener: 1263.41579494 hartree
kineticenergy: 673.82955034 hartree
xcener: -69.479805612451 hartree
chargesum: -0.0000000
charge: -0.369023 -0.320788 -0.291791 -0.099149 -0.109108 -0.101653 -0.115598 -0.109815 -0.123532 -0.104315 -0.144628 -0.077623 -0.116638 -0.090702 -0.254324 0.329389 0.052679 0.051682 0.054223 0.053437 0.050925 0.053980 0.058777 0.053868 0.048923 0.054797 0.069946 0.063881 0.068028 0.040768 0.072297 0.065510 0.057456 0.052538 0.068243 0.060071 0.042357 0.096213 0.077796 0.071746 0.086171 0.143283 0.149493 0.131776 0.148436
qa: -0.3690 -0.3208 -0.2918 -0.0991 -0.1091 -0.1017 -0.1156 -0.1098 -0.1235 -0.1043 -0.1446 -0.0776 -0.1166 -0.0907 -0.2543 0.3294 0.0527 0.0517 0.0542 0.0534 0.0509 0.0540 0.0588 0.0539 0.0489 0.0548 0.0699 0.0639 0.0680 0.0408 0.0723 0.0655 0.0575 0.0525 0.0682 0.0601 0.0424 0.0962 0.0778 0.0717 0.0862 0.1433 0.1495 0.1318 0.1484
va: 2.9722 3.1523 3.0838 3.8885 3.8962 3.8924 3.8711 3.8965 3.8782 3.8776 3.9045 3.8899 3.8852 3.9953 3.9341 4.2316 1.0124 1.0120 1.0120 1.0131 1.0120 1.0131 1.0117 1.0106 1.0106 1.0114 1.0132 1.0042 1.0347 1.0122 1.0081 1.0115 1.0269 1.0167 1.0086 1.0034 0.9978 0.9914 1.0029 1.0004 1.0074 1.0328 1.0395 1.0323 1.0427
dispcorr: -0.015263723 hartree
energy: -677.221496930227
dipole: 14.55135 -15.02105 -0.46971 -23.11230 23.95405 0.84175 -3.93993 3.61457 -0.32536
magnitude: 1.01736 au
magnitude: 2.58593 debye
