program: Orca
programVersion: 5.0.2
elementType: N N N C C C C C C C C C C C C C H H H H H H H H H H H H H H H H H H H H H H H H H H H H H
charge: 0
multiplicity: 1
keywords: wb97x-d3
keywords: def2-TZVPP
keywords: def2/J RIJCOSX
keywords: DEFGRID2
keywords: scfconv7
keywords: smallprint printgap noloewdin
keywords: NOSOSCF
formula: C13H29N3
InChI: InChI=1/C13H29N3/c1-2-3-4-5-6-7-8-9-10-11-12-16-13(14)15/h2-12,14-15H2,1H3
45 atoms
N  -1.01908 2.342572 -1.002709
N  0.447476 2.285081 0.88396
N  1.250421 2.149826 -1.263333
C  -1.399358 -1.907165 -0.841766
C  -0.621512 -2.750795 0.164368
C  -2.883377 -1.761215 -0.510476
C  0.887931 -2.753413 -0.072687
C  -3.182251 -1.019293 0.794768
C  1.58254 -1.496638 0.440899
C  -2.537559 0.361366 0.897864
C  3.069302 -1.454796 0.109826
C  -3.078603 1.371154 -0.109043
C  3.807119 -0.289164 0.757321
C  -2.211245 2.620378 -0.254154
C  5.275251 -0.21897 0.364147
C  0.126738 2.2690 -0.462925
H  -1.305345 -2.37078 -1.828604
H  -0.948138 -0.915591 -0.943775
H  -1.002887 -3.775661 0.125761
H  -0.813176 -2.401319 1.18401
H  -3.341476 -2.754277 -0.460321
H  -3.37837 -1.252875 -1.341888
H  1.090473 -2.879861 -1.142127
H  1.334624 -3.622276 0.420033
H  -4.267309 -0.924556 0.903446
H  -2.855769 -1.626292 1.643555
H  1.093542 -0.603214 0.039386
H  1.449753 -1.437897 1.52649
H  -2.693617 0.751119 1.909324
H  -1.454618 0.261142 0.784743
H  3.199007 -1.412532 -0.977479
H  3.540797 -2.39144 0.427133
H  -4.091996 1.663773 0.183181
H  -3.161897 0.920573 -1.100787
H  3.719802 -0.367907 1.844835
H  3.314158 0.653522 0.4958
H  -2.782208 3.372958 -0.805493
H  -2.043705 3.060438 0.744762
H  5.391921 -0.098403 -0.714038
H  5.781424 0.618136 0.845434
H  5.80355 -1.130076 0.649169
H  1.298014 2.77075 1.115975
H  -0.306628 2.504264 1.511559
H  1.936769 1.483539 -0.943866
H  1.004334 2.014245 -2.230437
totalener: -677.20080776 hartree
nucrepener: 1198.93956256 hartree
electener: -1876.14037032 hartree
oneelecener: -3295.59241842 hartree
twoeener: 1419.45204810 hartree
kineticenergy: 673.82116140 hartree
xcener: -69.484539069776 hartree
chargesum: 0.0000000
charge: -0.344106 -0.300360 -0.304295 -0.104249 -0.140209 -0.161964 -0.126977 -0.153236 0.000068 -0.134039 -0.164161 -0.091511 -0.065684 -0.052525 -0.252274 0.270518 0.071808 0.056235 0.075262 0.061921 0.069033 0.076679 0.055243 0.069831 0.069927 0.074613 -0.028228 0.055102 0.075278 0.042590 0.060438 0.060596 0.064639 0.070505 0.062776 0.017282 0.087680 0.034202 0.071772 0.084392 0.076038 0.145276 0.153508 0.162310 0.148293
qa: -0.3441 -0.3004 -0.3043 -0.1042 -0.1402 -0.1620 -0.1270 -0.1532 0.0001 -0.1340 -0.1642 -0.0915 -0.0657 -0.0525 -0.2523 0.2705 0.0718 0.0562 0.0753 0.0619 0.0690 0.0767 0.0552 0.0698 0.0699 0.0746 -0.0282 0.0551 0.0753 0.0426 0.0604 0.0606 0.0646 0.0705 0.0628 0.0173 0.0877 0.0342 0.0718 0.0844 0.0760 0.1453 0.1535 0.1623 0.1483
va: 2.9813 3.0926 3.1152 3.8510 3.9058 3.9213 3.9371 3.9291 3.8306 3.8943 3.9123 3.8088 3.8785 4.0024 3.9533 4.2685 1.0148 1.0149 1.0114 1.0079 1.0105 1.0057 1.0098 1.0105 1.0101 1.0038 1.0533 1.0152 1.0090 1.0108 1.0047 1.0134 1.0158 1.0269 1.0087 1.0252 1.0028 1.0110 1.0040 1.0063 1.0042 1.0301 1.0369 1.0260 1.0437
dispcorr: -0.021324240 hartree
energy: -677.222131999416
dipole: 5.04593 -4.52822 0.51772 -9.30523 9.27442 -0.03081 3.63239 -2.94158 0.69081
magnitude: 0.86383 au
magnitude: 2.19567 debye
