program: Orca
programVersion: 5.0.2
elementType: N N N C C C C C C C C C C C C C H H H H H H H H H H H H H H H H H H H H H H H H H H H H H
charge: 0
multiplicity: 1
keywords: wb97x-d3
keywords: def2-TZVPP
keywords: def2/J RIJCOSX
keywords: DEFGRID2
keywords: scfconv7
keywords: smallprint printgap noloewdin
keywords: NOSOSCF
formula: C13H29N3
InChI: InChI=1/C13H29N3/c1-2-3-4-5-6-7-8-9-10-11-12-16-13(14)15/h2-12,14-15H2,1H3
45 atoms
N  -0.743342 2.985487 0.471767
N  0.651439 1.918269 -1.140694
N  1.529032 3.355453 0.425082
C  -1.768921 -2.299799 -0.873556
C  -0.408447 -2.973969 -0.704919
C  -2.482682 -2.008638 0.44401
C  0.644334 -2.056475 -0.09009
C  -3.684429 -1.073588 0.319832
C  2.039094 -2.66962 -0.049116
C  -3.361914 0.308891 -0.251214
C  3.075387 -1.794159 0.651974
C  -2.191646 1.00195 0.432902
C  3.360489 -0.473905 -0.055348
C  -1.931125 2.41195 -0.097136
C  4.400029 0.369897 0.668873
C  0.383132 2.749614 -0.064054
H  -2.416497 -2.92278 -1.497806
H  -1.620084 -1.3726 -1.436901
H  -0.055011 -3.31073 -1.684636
H  -0.512717 -3.878467 -0.095937
H  -1.780116 -1.583722 1.164936
H  -2.811795 -2.954964 0.883608
H  0.353979 -1.782967 0.929314
H  0.665291 -1.117853 -0.653339
H  -4.455184 -1.542557 -0.299505
H  -4.128977 -0.951698 1.31202
H  1.988412 -3.636537 0.46133
H  2.374808 -2.886995 -1.069159
H  -3.152891 0.227266 -1.32312
H  -4.255757 0.935916 -0.176306
H  4.01102 -2.354074 0.749255
H  2.740421 -1.591089 1.675339
H  -1.28231 0.408186 0.301254
H  -2.358344 1.056133 1.512759
H  2.437836 0.102095 -0.159636
H  3.703132 -0.679846 -1.07463
H  -1.92157 2.380309 -1.201813
H  -2.78021 3.051308 0.157301
H  4.072384 0.619112 1.680237
H  5.352033 -0.155833 0.757979
H  4.597506 1.306122 0.14317
H  1.395944 2.229709 -1.74336
H  -0.1502 1.597614 -1.657495
H  2.325299 2.741731 0.515275
H  1.341674 3.855791 1.279167
totalener: -677.20137713 hartree
nucrepener: 1186.60027452 hartree
electener: -1863.80165165 hartree
oneelecener: -3270.77422858 hartree
twoeener: 1406.97257693 hartree
kineticenergy: 673.82042243 hartree
xcener: -69.484369088217 hartree
chargesum: 0.0000000
charge: -0.354219 -0.329773 -0.298433 -0.144200 -0.116974 -0.126685 -0.092842 -0.157058 -0.132437 -0.124275 -0.122453 -0.110919 -0.019664 -0.029334 -0.302999 0.319119 0.079394 0.052554 0.066182 0.060465 0.071128 0.077492 0.061597 0.031359 0.069188 0.073207 0.068372 0.056999 0.056360 0.072450 0.068394 0.055617 0.020606 0.081847 0.006000 0.055156 0.037714 0.084185 0.080909 0.084647 0.078530 0.146071 0.152973 0.144844 0.148905
qa: -0.3542 -0.3298 -0.2984 -0.1442 -0.1170 -0.1267 -0.0928 -0.1571 -0.1324 -0.1243 -0.1225 -0.1109 -0.0197 -0.0293 -0.3030 0.3191 0.0794 0.0526 0.0662 0.0605 0.0711 0.0775 0.0616 0.0314 0.0692 0.0732 0.0684 0.0570 0.0564 0.0724 0.0684 0.0556 0.0206 0.0818 0.0060 0.0552 0.0377 0.0842 0.0809 0.0846 0.0785 0.1461 0.1530 0.1448 0.1489
va: 3.0218 3.1168 3.0978 3.8929 3.9085 3.8500 3.8572 3.9337 3.9352 3.8568 3.9114 3.8432 3.8253 4.0022 3.9546 4.2403 1.0128 1.0114 1.0098 1.0124 1.0050 1.0114 1.0067 1.0217 1.0102 1.0085 1.0119 1.0121 1.0064 1.0148 1.0124 1.0112 1.0191 1.0228 1.0319 1.0085 1.0104 1.0054 0.9981 1.0086 1.0022 1.0310 1.0357 1.0307 1.0415
dispcorr: -0.020494248 hartree
energy: -677.221871380455
dipole: 3.37530 -2.88756 0.48774 -11.55343 11.09258 -0.46085 -0.52026 -0.02086 -0.54112
magnitude: 0.86202 au
magnitude: 2.19108 debye
