program: Orca
programVersion: 5.0.2
elementType: N N N C C C C C C C C C C C C C H H H H H H H H H H H H H H H H H H H H H H H H H H H H H
charge: 0
multiplicity: 1
keywords: wb97x-d3
keywords: def2-TZVPP
keywords: def2/J RIJCOSX
keywords: DEFGRID2
keywords: scfconv7
keywords: smallprint printgap noloewdin
keywords: NOSOSCF
formula: C13H29N3
InChI: InChI=1/C13H29N3/c1-2-3-4-5-6-7-8-9-10-11-12-16-13(14)15/h2-12,14-15H2,1H3
45 atoms
N  -0.680659 1.679369 -0.127675
N  -0.059636 3.782687 -1.032522
N  1.110926 1.875141 -1.565204
C  -1.343484 -2.261901 -1.017813
C  -0.398557 -3.3890 -0.607304
C  -1.975474 -1.512658 0.146914
C  0.729551 -2.978259 0.338207
C  -2.95557 -0.442734 -0.314599
C  1.565118 -1.80263 -0.154425
C  -3.476426 0.448951 0.809618
C  2.772164 -1.515686 0.729716
C  -2.432903 1.280012 1.555154
C  3.590941 -0.317028 0.267155
C  -1.682605 2.298216 0.704592
C  4.800434 -0.049862 1.151539
C  0.055624 2.418977 -0.852526
H  -2.130224 -2.678996 -1.654819
H  -0.810932 -1.539444 -1.644861
H  0.036921 -3.828732 -1.510376
H  -0.977226 -4.188769 -0.134568
H  -1.186618 -1.041351 0.736268
H  -2.482481 -2.218934 0.814943
H  1.381972 -3.842846 0.49681
H  0.319769 -2.734785 1.323155
H  -2.472915 0.172559 -1.076343
H  -3.81027 -0.923668 -0.802046
H  1.90362 -1.99771 -1.179321
H  0.936819 -0.906349 -0.196873
H  -4.229516 1.130345 0.399263
H  -4.006697 -0.171645 1.539768
H  3.414251 -2.402718 0.768938
H  2.433466 -1.344977 1.757444
H  -1.702617 0.637071 2.052471
H  -2.948303 1.822456 2.353433
H  2.953451 0.571059 0.238463
H  3.923259 -0.481309 -0.762982
H  -2.422975 2.855258 0.107664
H  -1.230742 3.035727 1.387892
H  5.370197 0.812121 0.803615
H  4.5001 0.149429 2.181645
H  5.47628 -0.906637 1.169088
H  0.802231 4.277076 -1.190067
H  -0.677422 4.26343 -0.402307
H  1.206796 2.216529 -2.508915
H  1.110891 0.868266 -1.526401
totalener: -677.20269897 hartree
nucrepener: 1192.10111652 hartree
electener: -1869.30381549 hartree
oneelecener: -3282.51224204 hartree
twoeener: 1413.20842655 hartree
kineticenergy: 673.82875046 hartree
xcener: -69.485308654120 hartree
chargesum: 0.0000000
charge: -0.380779 -0.318620 -0.312465 -0.110725 -0.170093 -0.126934 -0.125028 -0.095949 -0.090361 -0.152915 -0.085879 -0.128321 -0.078848 -0.069089 -0.265803 0.359769 0.071051 0.054623 0.067718 0.069559 0.059473 0.068821 0.068920 0.066723 0.060605 0.069674 0.069767 -0.006853 0.064132 0.065314 0.050669 0.053778 0.061430 0.071767 0.051737 0.049392 0.069899 0.069877 0.082498 0.072357 0.072632 0.144109 0.150048 0.131496 0.170823
qa: -0.3808 -0.3186 -0.3125 -0.1107 -0.1701 -0.1269 -0.1250 -0.0959 -0.0904 -0.1529 -0.0859 -0.1283 -0.0788 -0.0691 -0.2658 0.3598 0.0711 0.0546 0.0677 0.0696 0.0595 0.0688 0.0689 0.0667 0.0606 0.0697 0.0698 -0.0069 0.0641 0.0653 0.0507 0.0538 0.0614 0.0718 0.0517 0.0494 0.0699 0.0699 0.0825 0.0724 0.0726 0.1441 0.1500 0.1315 0.1708
va: 2.9111 3.1688 3.0941 3.8614 3.9236 3.8594 3.9070 3.8565 3.8543 3.9438 3.8640 3.9192 3.8813 3.9251 3.9694 4.1596 1.0117 1.0107 1.0091 1.0095 1.0053 1.0127 1.0124 1.0030 1.0289 1.0112 1.0058 1.0499 1.0091 1.0108 1.0124 1.0113 1.0187 1.0107 1.0202 1.0053 0.9863 0.9957 1.0055 1.0031 1.0031 1.0338 1.0381 1.0348 1.0304
dispcorr: -0.020122237 hartree
energy: -677.222821207409
dipole: 4.28748 -4.02196 0.26552 -7.87845 8.91455 1.03610 3.48668 -3.88084 -0.39416
magnitude: 1.13990 au
magnitude: 2.89738 debye
