program: Orca
programVersion: 5.0.2
elementType: N N N C C C C C C C C C C C C C H H H H H H H H H H H H H H H H H H H H H H H H H H H H H
charge: 0
multiplicity: 1
keywords: wb97x-d3
keywords: def2-TZVPP
keywords: def2/J RIJCOSX
keywords: DEFGRID2
keywords: scfconv7
keywords: smallprint printgap noloewdin
keywords: NOSOSCF
formula: C13H29N3
InChI: InChI=1/C13H29N3/c1-2-3-4-5-6-7-8-9-10-11-12-16-13(14)15/h2-12,14-15H2,1H3
45 atoms
N  -1.278277 2.514899 -0.971502
N  0.667186 2.003114 0.318693
N  0.690971 1.886218 -1.972709
C  -1.139754 -2.753197 -0.066894
C  -0.264225 -2.378413 -1.263438
C  -1.460882 -1.604547 0.885488
C  1.064468 -1.713632 -0.910075
C  -2.175451 -0.428489 0.233145
C  1.969201 -2.559259 -0.021617
C  -2.524101 0.66843 1.234248
C  3.374846 -1.986479 0.151148
C  -3.097382 1.946832 0.618846
C  3.438162 -0.573619 0.728649
C  -2.062032 2.965896 0.141052
C  2.76139 -0.425739 2.083792
C  -0.064147 2.169193 -0.846244
H  -0.661398 -3.558444 0.49806
H  -2.075786 -3.176013 -0.444862
H  -0.822358 -1.715637 -1.930421
H  -0.066219 -3.284033 -1.845438
H  -0.53963 -1.243293 1.356087
H  -2.075201 -1.991509 1.70516
H  0.873565 -0.749685 -0.428369
H  1.596324 -1.489733 -1.84285
H  -1.565994 -0.014944 -0.570279
H  -3.096749 -0.779157 -0.245643
H  1.503744 -2.696038 0.958732
H  2.054364 -3.563752 -0.448706
H  -3.24451 0.262366 1.950987
H  -1.636383 0.913259 1.830054
H  3.883462 -1.9931 -0.818165
H  3.951397 -2.656922 0.796234
H  -3.72418 2.452532 1.358973
H  -3.757127 1.691965 -0.215334
H  2.991868 0.136015 0.0259
H  4.488647 -0.28315 0.814073
H  -2.60349 3.862363 -0.176398
H  -1.471972 3.286825 1.017668
H  3.150579 -1.14903 2.802879
H  2.924833 0.568832 2.500647
H  1.68289 -0.57219 2.015935
H  1.633183 2.280906 0.259722
H  0.226596 2.317755 1.165739
H  1.257925 1.054481 -1.903196
H  0.126071 1.893559 -2.806604
totalener: -677.19881752 hartree
nucrepener: 1232.37476482 hartree
electener: -1909.57358234 hartree
oneelecener: -3362.37524964 hartree
twoeener: 1452.80166730 hartree
kineticenergy: 673.82072329 hartree
xcener: -69.487811689346 hartree
chargesum: -0.0000000
charge: -0.347668 -0.302440 -0.292833 -0.159732 -0.151331 -0.077286 -0.072001 -0.156031 -0.154954 -0.142420 -0.145360 -0.091680 -0.083339 -0.056121 -0.274706 0.270995 0.077746 0.072754 0.075592 0.074758 0.038744 0.074613 -0.022609 0.078561 0.076340 0.068800 0.069351 0.075588 0.079197 0.044956 0.066753 0.073953 0.070724 0.062200 0.026216 0.076440 0.084403 0.035136 0.089992 0.081426 0.079385 0.150962 0.152804 0.155544 0.146579
qa: -0.3477 -0.3024 -0.2928 -0.1597 -0.1513 -0.0773 -0.0720 -0.1560 -0.1550 -0.1424 -0.1454 -0.0917 -0.0833 -0.0561 -0.2747 0.2710 0.0777 0.0728 0.0756 0.0748 0.0387 0.0746 -0.0226 0.0786 0.0763 0.0688 0.0694 0.0756 0.0792 0.0450 0.0668 0.0740 0.0707 0.0622 0.0262 0.0764 0.0844 0.0351 0.0900 0.0814 0.0794 0.1510 0.1528 0.1555 0.1466
va: 2.9753 3.0966 3.1218 3.9121 3.9110 3.8547 3.8389 3.8583 3.8950 3.8922 3.9141 3.8375 3.8326 4.0006 3.9440 4.2661 1.0042 1.0119 1.0077 1.0103 1.0109 1.0148 1.0232 1.0048 1.0151 1.0163 0.9993 1.0143 1.0088 1.0167 1.0132 1.0089 1.0104 1.0187 1.0281 1.0097 1.0050 1.0105 1.0085 1.0073 0.9898 1.0256 1.0383 1.0301 1.0444
dispcorr: -0.023664344 hartree
energy: -677.222481865762
dipole: 4.21633 -3.58565 0.63068 -9.44362 9.25451 -0.18911 6.15394 -5.71811 0.43584
magnitude: 0.78960 au
magnitude: 2.00701 debye
