program: Orca
programVersion: 5.0.2
elementType: N N N C C C C C C C C C C C C C H H H H H H H H H H H H H H H H H H H H H H H H H H H H H
charge: 0
multiplicity: 1
keywords: wb97x-d3
keywords: def2-TZVPP
keywords: def2/J RIJCOSX
keywords: DEFGRID2
keywords: scfconv7
keywords: smallprint printgap noloewdin
keywords: NOSOSCF
formula: C13H29N3
InChI: InChI=1/C13H29N3/c1-2-3-4-5-6-7-8-9-10-11-12-16-13(14)15/h2-12,14-15H2,1H3
45 atoms
N  -0.196498 1.788228 0.119842
N  0.285814 4.077412 -0.288574
N  1.408429 2.409433 -1.407033
C  -1.434052 -2.169592 -1.122494
C  -0.33775 -3.223637 -0.980111
C  -2.383626 -2.101362 0.069012
C  0.658911 -2.965746 0.149954
C  -3.437445 -0.999957 -0.0435
C  1.427575 -1.655977 0.011972
C  -2.871317 0.418576 -0.086183
C  2.424506 -1.433696 1.144188
C  -2.153722 0.844754 1.190227
C  3.11393 -0.072792 1.096803
C  -1.300908 2.090754 0.990549
C  4.048632 0.104192 -0.092834
C  0.437818 2.718437 -0.468721
H  -2.016966 -2.381682 -2.024719
H  -0.974833 -1.192507 -1.290487
H  0.212421 -3.289804 -1.924219
H  -0.798409 -4.205917 -0.833402
H  -1.815393 -1.96644 0.99297
H  -2.88859 -3.066813 0.176141
H  1.370393 -3.797059 0.185366
H  0.143526 -2.982246 1.115556
H  -4.03421 -1.170824 -0.945114
H  -4.133685 -1.08568 0.797157
H  1.946375 -1.654148 -0.95362
H  0.737592 -0.806599 -0.007217
H  -2.183473 0.518016 -0.928841
H  -3.686809 1.121717 -0.284123
H  3.176768 -2.230695 1.14267
H  1.894165 -1.523004 2.09748
H  -1.492888 0.051375 1.547154
H  -2.88398 1.022494 1.985595
H  3.686577 0.070839 2.017058
H  2.348513 0.708696 1.088703
H  -1.949174 2.897765 0.60564
H  -0.94005 2.432562 1.969857
H  4.52515 1.085557 -0.082197
H  4.843411 -0.643778 -0.08421
H  3.527826 0.003678 -1.046529
H  0.428446 4.645232 -1.107153
H  -0.505667 4.367519 0.258796
H  2.264523 2.934618 -1.318361
H  1.582713 1.417326 -1.442351
totalener: -677.20317156 hartree
nucrepener: 1206.53423964 hartree
electener: -1883.73741120 hartree
oneelecener: -3311.31190211 hartree
twoeener: 1427.57449092 hartree
kineticenergy: 673.82513672 hartree
xcener: -69.487128285202 hartree
chargesum: -0.0000000
charge: -0.404681 -0.322371 -0.308428 -0.120726 -0.147468 -0.133382 -0.142430 -0.141859 -0.098054 -0.143398 -0.093197 -0.094993 -0.111315 -0.082154 -0.283468 0.377948 0.074612 0.063240 0.067609 0.068193 0.059348 0.071963 0.069572 0.062486 0.066029 0.066444 0.061773 0.022419 0.074629 0.068991 0.057179 0.061652 0.062492 0.070822 0.071226 0.057651 0.041589 0.096995 0.086988 0.084704 0.060318 0.145302 0.151362 0.137259 0.167127
qa: -0.4047 -0.3224 -0.3084 -0.1207 -0.1475 -0.1334 -0.1424 -0.1419 -0.0981 -0.1434 -0.0932 -0.0950 -0.1113 -0.0822 -0.2835 0.3779 0.0746 0.0632 0.0676 0.0682 0.0593 0.0720 0.0696 0.0625 0.0660 0.0664 0.0618 0.0224 0.0746 0.0690 0.0572 0.0617 0.0625 0.0708 0.0712 0.0577 0.0416 0.0970 0.0870 0.0847 0.0603 0.1453 0.1514 0.1373 0.1671
va: 2.9155 3.1743 3.1229 3.8514 3.9277 3.8856 3.9235 3.9441 3.8439 3.8656 3.8623 3.8723 3.8681 3.9735 3.9355 4.1223 1.0103 1.0107 1.0095 1.0109 1.0080 1.0124 1.0119 1.0055 1.0097 1.0078 1.0061 1.0452 1.0213 1.0093 1.0119 1.0133 1.0228 1.0156 1.0118 1.0313 1.0012 0.9942 1.0031 1.0078 1.0024 1.0324 1.0391 1.0309 1.0419
dispcorr: -0.021523700 hartree
energy: -677.224695257475
dipole: 2.04482 -1.87824 0.16658 -8.81442 9.89570 1.08127 1.35675 -1.47869 -0.12194
magnitude: 1.10081 au
magnitude: 2.79802 debye
