program: Orca
programVersion: 5.0.2
elementType: N N N C C C C C C C C C C C C C H H H H H H H H H H H H H H H H H H H H H H H H H H H H H
charge: 0
multiplicity: 1
keywords: wb97x-d3
keywords: def2-TZVPP
keywords: def2/J RIJCOSX
keywords: DEFGRID2
keywords: scfconv7
keywords: smallprint printgap noloewdin
keywords: NOSOSCF
formula: C13H29N3
InChI: InChI=1/C13H29N3/c1-2-3-4-5-6-7-8-9-10-11-12-16-13(14)15/h2-12,14-15H2,1H3
45 atoms
N  -0.134879 1.966906 0.05652
N  0.222618 4.263229 0.548179
N  1.440775 2.624635 1.602391
C  -1.251768 -2.345605 0.198457
C  -0.305901 -3.303319 -0.514499
C  -2.497579 -2.042695 -0.626305
C  0.940571 -3.677563 0.283443
C  -3.388959 -0.9460 -0.045635
C  1.781156 -2.497137 0.768064
C  -2.690637 0.394804 0.176981
C  2.161732 -1.501651 -0.321488
C  -2.048458 0.984085 -1.071434
C  3.190659 -0.478209 0.141508
C  -1.265038 2.257574 -0.785712
C  3.407009 0.633516 -0.874577
C  0.449696 2.908597 0.677676
H  -0.722457 -1.41371 0.415295
H  -1.543778 -2.760825 1.16975
H  -0.008871 -2.857249 -1.469342
H  -0.843702 -4.220535 -0.774901
H  -3.087905 -2.957312 -0.738997
H  -2.193956 -1.76763 -1.641437
H  1.566694 -4.327899 -0.335361
H  0.648348 -4.27951 1.149421
H  -4.244396 -0.801126 -0.713242
H  -3.806648 -1.287514 0.906604
H  1.251209 -1.962769 1.562977
H  2.690561 -2.889745 1.234684
H  -3.422348 1.109079 0.569442
H  -1.927436 0.299729 0.952424
H  1.270849 -0.9652 -0.662663
H  2.552742 -2.034392 -1.195625
H  -2.81736 1.192774 -1.822479
H  -1.358738 0.267075 -1.523971
H  4.137542 -0.980566 0.360694
H  2.861809 -0.047799 1.09371
H  -0.939334 2.689904 -1.741847
H  -1.956254 2.993494 -0.33826
H  4.16058 1.348674 -0.541577
H  3.74235 0.229516 -1.831227
H  2.478171 1.177607 -1.052651
H  0.338839 4.807348 1.386552
H  -0.58343 4.532335 0.011406
H  2.267558 3.19614 1.522043
H  1.665577 1.642354 1.608431
totalener: -677.20380918 hartree
nucrepener: 1195.77008854 hartree
electener: -1872.97389772 hartree
oneelecener: -3289.74064867 hartree
twoeener: 1416.76675095 hartree
kineticenergy: 673.83036605 hartree
xcener: -69.486245387491 hartree
chargesum: 0.0000000
charge: -0.401013 -0.323928 -0.315537 -0.138043 -0.100921 -0.126383 -0.170519 -0.150025 -0.116268 -0.118547 -0.091344 -0.111677 -0.129550 -0.078559 -0.270791 0.370993 0.044815 0.069599 0.062034 0.071852 0.073301 0.061766 0.069222 0.068400 0.068011 0.067183 0.065233 0.067620 0.064489 0.074447 0.047896 0.067260 0.069518 0.061434 0.070391 0.041271 0.097157 0.041822 0.079647 0.080339 0.082676 0.145305 0.150877 0.134957 0.173589
qa: -0.4010 -0.3239 -0.3155 -0.1380 -0.1009 -0.1264 -0.1705 -0.1500 -0.1163 -0.1185 -0.0913 -0.1117 -0.1296 -0.0786 -0.2708 0.3710 0.0448 0.0696 0.0620 0.0719 0.0733 0.0618 0.0692 0.0684 0.0680 0.0672 0.0652 0.0676 0.0645 0.0744 0.0479 0.0673 0.0695 0.0614 0.0704 0.0413 0.0972 0.0418 0.0796 0.0803 0.0827 0.1453 0.1509 0.1350 0.1736
va: 2.9221 3.1679 3.1152 3.8628 3.8514 3.8798 3.9392 3.9415 3.8578 3.8429 3.8323 3.8912 3.8920 3.9639 3.9366 4.1339 1.0164 1.0132 1.0071 1.0125 1.0127 1.0057 1.0083 1.0095 1.0085 1.0093 1.0038 1.0115 1.0104 1.0231 1.0199 1.0129 1.0173 1.0198 1.0124 1.0154 0.9929 1.0022 1.0046 1.0076 1.0139 1.0326 1.0394 1.0313 1.0488
dispcorr: -0.020754436 hartree
energy: -677.224563619391
dipole: 1.40641 -1.26438 0.14203 -9.20639 10.22490 1.01851 -2.81717 3.01396 0.19679
magnitude: 1.04703 au
magnitude: 2.66133 debye
