program: Orca
programVersion: 5.0.2
elementType: N N N C C C C C C C C C C C C C H H H H H H H H H H H H H H H H H H H H H H H H H H H H H
charge: 0
multiplicity: 1
keywords: wb97x-d3
keywords: def2-TZVPP
keywords: def2/J RIJCOSX
keywords: DEFGRID2
keywords: scfconv7
keywords: smallprint printgap noloewdin
keywords: NOSOSCF
formula: C13H29N3
InChI: InChI=1/C13H29N3/c1-2-3-4-5-6-7-8-9-10-11-12-16-13(14)15/h2-12,14-15H2,1H3
45 atoms
N  -1.291597 2.229472 -1.084451
N  0.616643 2.167978 0.346056
N  0.674725 1.271362 -1.774012
C  -1.234766 -2.290921 -0.588901
C  -0.340218 -3.229408 0.219304
C  -1.87982 -1.186922 0.240594
C  0.793951 -2.552158 0.984365
C  -2.926792 -0.394995 -0.532614
C  1.774622 -1.790885 0.101444
C  -3.62656 0.680588 0.298017
C  2.916867 -1.161645 0.8895
C  -2.737633 1.760423 0.914555
C  3.918241 -0.414249 0.017652
C  -2.15335 2.777974 -0.070322
C  5.060411 0.202022 0.811881
C  -0.089118 1.925792 -0.818178
H  -2.017771 -2.888324 -1.066725
H  -0.668103 -1.836005 -1.407127
H  0.084378 -3.982242 -0.452617
H  -0.961233 -3.781229 0.932046
H  -1.099135 -0.511244 0.601709
H  -2.340013 -1.623158 1.136121
H  1.33965 -3.315415 1.548407
H  0.379412 -1.873808 1.737299
H  -2.469983 0.058608 -1.413413
H  -3.68964 -1.089439 -0.900389
H  2.18869 -2.473274 -0.649464
H  1.253759 -1.011057 -0.462905
H  -4.388484 1.166431 -0.319842
H  -4.172497 0.188966 1.110287
H  3.442566 -1.936295 1.45835
H  2.50777 -0.476691 1.643455
H  -1.938473 1.295357 1.500406
H  -3.336815 2.322282 1.637875
H  3.398064 0.365932 -0.548421
H  4.321743 -1.099698 -0.733121
H  -2.988334 3.265482 -0.58113
H  -1.671092 3.58153 0.509367
H  4.693369 0.921372 1.546235
H  5.617462 -0.562025 1.356321
H  5.765662 0.724969 0.165701
H  1.311082 1.479626 0.587545
H  0.075121 2.466089 1.138051
H  1.618974 1.612529 -1.867792
H  0.196459 1.234568 -2.660072
totalener: -677.20053696 hartree
nucrepener: 1209.99110680 hartree
electener: -1887.19164376 hartree
oneelecener: -3317.71580733 hartree
twoeener: 1430.52416358 hartree
kineticenergy: 673.82026951 hartree
xcener: -69.485299938420 hartree
chargesum: -0.0000000
charge: -0.345696 -0.309208 -0.288330 -0.124529 -0.165280 -0.105540 -0.103428 -0.121921 -0.089711 -0.126041 -0.163888 -0.163304 -0.061629 -0.046863 -0.252047 0.279050 0.069050 0.065630 0.070257 0.071276 0.015886 0.072877 0.074269 0.058688 0.076539 0.068628 0.064901 0.027053 0.066352 0.070699 0.070529 0.045095 0.049427 0.079214 0.025386 0.063842 0.079063 0.067747 0.069367 0.076750 0.085871 0.161325 0.151464 0.141616 0.149562
qa: -0.3457 -0.3092 -0.2883 -0.1245 -0.1653 -0.1055 -0.1034 -0.1219 -0.0897 -0.1260 -0.1639 -0.1633 -0.0616 -0.0469 -0.2520 0.2790 0.0690 0.0656 0.0703 0.0713 0.0159 0.0729 0.0743 0.0587 0.0765 0.0686 0.0649 0.0271 0.0664 0.0707 0.0705 0.0451 0.0494 0.0792 0.0254 0.0638 0.0791 0.0677 0.0694 0.0768 0.0859 0.1613 0.1515 0.1416 0.1496
va: 2.9376 3.1740 3.0493 3.8525 3.9334 3.8516 3.8576 3.8844 3.8350 3.9111 3.8889 3.8946 3.8644 3.9424 3.9517 4.2404 1.0144 1.0121 1.0106 1.0092 1.0122 1.0109 1.0126 1.0043 1.0323 1.0120 1.0183 1.0327 1.0118 1.0082 1.0145 1.0074 1.0062 1.0149 1.0203 1.0099 1.0032 0.9992 1.0032 1.0041 1.0064 1.0308 1.0384 1.0246 1.0430
dispcorr: -0.022065940 hartree
energy: -677.222602899272
dipole: 6.02909 -5.32065 0.70844 -7.67239 7.66432 -0.00807 5.18537 -4.79192 0.39345
magnitude: 0.81041 au
magnitude: 2.05989 debye
